program: Gaussian 09
title: 000106587
version: EM64L-G09RevD.01
frameworkgroup: C1[X(C15H31NO2)]
method: RPBEPBE
basis: SDD
operation: Freq
keyword: #p
keyword: freq=noraman
keyword: PBEPBE/SDD
title: #p freq=noraman PBEPBE/SDD
converged: YES YES NO NO
title: Mulliken charges:
elementType: O O N C C C C C C C C C C C C C C C H H H H H H H H H H H H H H H H H H H H H H H H H H H H H H H
charge: -0.411471 -0.240682 -0.313308 -0.386194 -0.385728 -0.385163 -0.384872 -0.382372 -0.381915 -0.372370 -0.372780 -0.397596 -0.353334 -0.359979 -0.356677 -0.696757 -0.406474 0.178422 0.193979 0.194109 0.193332 0.193283 0.193369 0.192985 0.193028 0.193111 0.193245 0.195359 0.191722 0.191676 0.190607 0.190047 0.189293 0.189348 0.186069 0.220513 0.187519 0.187437 0.181065 0.206344 0.194730 0.194753 0.284684 0.209573 0.209560 0.214880 0.216940 0.254653 0.382036
chargesum: 0.00000
title: Mulliken charges with hydrogens summed into heavy atoms:
elementType: O O N C C C C C C C C C C C C C C C
charge: -0.029435 -0.240682 -0.028624 0.001894 0.000887 0.001191 0.001267 0.006232 0.001482 0.008285 0.005861 0.008986 0.021622 0.027430 0.032806 -0.062744 0.065119 0.178422
polarizability: 2.47285223e+02 4.89699824e-01 1.56898252e+02 1.08145227e+00 7.67754151e-01 1.36275756e+02
1716.lowfreq: -52.4355 -19.9435 -6.2330 -1.9875 -0.0023 0.0009 0.0016 6.6840 17.5420
frequency: -37.9865 -7.0522 17.4648 22.2112 25.8172 44.7898 46.7876 68.5367 72.1961 86.4932 97.3580 103.6693 120.1279 124.2462 128.8697 139.8263 142.1954 147.8783 159.3248 206.9129 234.8812 254.0408 276.2127 341.8620 359.8972 406.2569 440.7611 468.2361 498.2065 499.6474 522.4857 597.1797 613.9345 641.5078 715.3980 717.1204 721.2485 730.2017 746.5834 772.0874 808.0660 851.5927 866.7682 887.3363 900.1631 948.2680 976.1477 982.7308 985.9581 996.7100 1007.5414 1016.2957 1030.0214 1040.2157 1045.7800 1063.5028 1071.1763 1078.8508 1081.2350 1082.2320 1082.6635 1105.0814 1125.7865 1153.7648 1179.5895 1184.0203 1192.8478 1199.1638 1207.1247 1224.8247 1227.0990 1246.5912 1249.7823 1262.8445 1266.1063 1274.9223 1276.8412 1279.6395 1281.0586 1286.6866 1289.5808 1293.9929 1294.9722 1299.4812 1319.2206 1335.1729 1346.4026 1350.4220 1352.8364 1354.3414 1358.2528 1388.4429 1388.8138 1456.3559 1456.4312 1459.5709 1459.7869 1460.9528 1462.3741 1464.5860 1467.8445 1468.5527 1472.6155 1477.2349 1477.9522 1481.8701 1485.3383 1486.9902 1497.5391 1667.6999 2821.1719 2834.1006 2946.8363 2947.1094 2948.4896 2948.8885 2950.5803 2951.5959 2954.4999 2957.7411 2960.8695 2964.1065 2966.3604 2970.8848 2979.3652 2981.7262 2982.5178 2985.5608 2990.6182 2997.0131 3005.5377 3010.0977 3015.1214 3024.4901 3032.9433 3039.8781 3045.4127 3067.4929 3069.5041 3461.5095 3516.0595
redmass: 1.9004 3.7945 4.5843 2.4085 2.8456 4.0496 4.4069 1.8653 2.9004 4.2120 1.9969 2.3889 2.4548 2.6006 2.6662 2.7468 1.9751 2.8664 2.3822 3.8085 1.1047 4.6254 3.6983 3.5845 4.1291 3.2054 3.5746 2.9422 3.0988 2.1587 2.6561 3.2665 1.3817 1.5411 1.0581 1.0654 1.0773 1.0959 1.1216 1.1569 1.1951 1.2355 3.9024 1.9084 1.2293 1.2110 5.1861 4.7022 1.6266 1.3087 3.9457 3.4398 1.1013 3.2785 2.7489 2.9332 2.6100 2.0205 2.2585 2.1629 2.2437 2.3530 3.1551 1.6979 1.8584 1.8344 1.6562 1.3567 1.5702 1.3875 1.3732 1.3374 1.3128 1.4486 1.2913 1.1245 1.1834 1.1251 1.1101 1.0825 1.1126 1.1150 1.1113 1.3320 1.3820 1.4485 1.5334 1.7175 1.6460 1.6427 1.6806 1.2170 1.6099 1.0745 1.0739 1.0781 1.0700 1.1466 1.0697 1.0786 1.1157 1.1506 1.0883 1.0752 1.0563 1.0908 1.0938 1.0888 1.0925 8.2449 1.0719 1.0714 1.0584 1.0583 1.0589 1.0588 1.0592 1.0592 1.0598 1.0611 1.0612 1.0610 1.0584 1.0365 1.0960 1.0955 1.0841 1.0974 1.0992 1.1011 1.1030 1.0838 1.1041 1.1045 1.1044 1.1042 1.1032 1.1007 1.0993 1.0749 1.0640
irintensity: 0.4776 0.0019 0.0979 0.4112 0.0590 0.2258 0.3303 0.1569 0.3356 0.8916 0.1933 1.0641 0.4958 0.1548 1.5556 0.7989 0.4735 1.1803 1.4043 1.5500 0.0089 1.8888 0.2208 0.7870 4.4290 4.3890 7.0946 9.1511 2.1500 15.0524 15.3627 41.0384 51.4109 177.4976 19.7857 0.4041 8.1515 0.1885 3.1431 0.0863 0.9457 0.9963 5.0592 4.8238 1.0514 2.4891 0.5944 3.0619 9.2696 0.1043 3.7988 56.5823 0.1995 57.1475 79.7387 15.7536 61.1781 1.5746 11.7708 5.2540 40.4127 2.5337 8.7661 42.4360 3.0124 2.7546 29.3170 15.1707 0.8559 0.2960 0.3698 0.3853 0.2116 13.9064 8.1671 5.7880 5.6916 0.0924 0.3611 0.0310 0.8697 0.0902 0.2060 2.9135 4.4093 3.1668 5.9412 0.1215 0.4237 1.0401 3.7500 12.0527 49.3807 0.0552 0.0211 1.3797 0.0376 12.9451 0.3759 0.2855 16.3886 25.9575 1.5613 4.3559 8.4120 0.8110 6.2129 35.3821 7.0631 218.0344 83.2560 125.6792 0.0097 0.0607 0.0539 0.1462 1.2942 0.3399 2.4472 1.4122 18.2773 132.3170 229.2989 37.4824 0.0020 4.4750 54.5194 2.6684 1.1104 0.6122 0.3908 25.7402 0.2272 3.4114 2.9732 122.7483 277.3570 97.3777 55.4792 7.5109 26.1175
temp: 298.150 k
press: 1.00000 atm
elementType: 8 8 7 6 6 6 6 6 6 6 6 6 6 6 6 6 6 6 1 1 1 1 1 1 1 1 1 1 1 1 1 1 1 1 1 1 1 1 1 1 1 1 1 1 1 1 1 1 1
symmnumber: 1
zpe: 1149869.7 jmol-1
zpe.correction: 0.437962 hartree
zpe.thermalcorrener: 0.460246 hartree
zpe.thermalcorrenthalpy: 0.461190 hartree
zpe.thermalcorrgfe: 0.382303 hartree
zpe.sumelectzpe: -793.891777 hartree
zpe.sumelectthermal: -793.869494 hartree
zpe.sumelectthermalent: -793.868550 hartree
zpe.sumelectthermalfe: -793.947436 hartree
dipole: 0.0473 -1.4142 0.7565
dipole: 1.6045
quadrupole: -108.6891 -119.6569 -114.1850
quadrupole: 9.6171 -4.7342 0.3425
quadrupole: 5.4879 -5.4799 -0.0080 9.6171 -4.7342 0.3425
hfenergy: -794.3297395 hartree
pointgroup: C01 [X(C15H31N1O2)]
dipole: -0.0194123 -0.5938619 -0.213191 debye
polarizability: 247.2896355|-0.3790452|156.237736|0.8802327|-3.7119575|136.9318599 unknown
InChI: InChI=1S/C15H31NO2/c1-2-3-4-5-6-7-8-9-10-11-12-13-16-14-15(17)18/h16-17H,2-14H2,1H3
charge 0 multiplicity 1
49 atoms
O  9.573398 -0.318635 0.153259
O  8.283622 1.470106 -0.582569
N  5.93303 0.10193 0.149355
C  -1.705515 0.348139 0.030991
C  -3.023387 -0.457127 -0.023799
C  -0.442344 -0.540965 -0.013547
C  -4.287047 0.431692 0.013154
C  0.875216 0.26286 0.063285
C  -5.604877 -0.374359 -0.031222
C  2.137709 -0.626203 0.000638
C  -6.86868 0.514565 0.003089
C  3.450985 0.178924 0.115348
C  -8.186843 -0.29116 -0.038767
C  4.708321 -0.706567 0.022458
C  -9.450393 0.598883 -0.002642
C  -10.762536 -0.213985 -0.047289
C  7.187795 -0.643125 0.073887
C  8.355909 0.299252 -0.149887
H  -1.678804 1.065272 -0.816144
H  -1.68955 0.961105 0.956586
H  -3.052195 -1.169656 0.827229
H  -3.037292 -1.075222 -0.946094
H  -0.476705 -1.267558 0.825277
H  -0.451207 -1.143362 -0.94624
H  -4.269885 1.054654 0.932096
H  -4.261938 1.13978 -0.84166
H  0.904443 0.999355 -0.766896
H  0.889548 0.853655 1.002883
H  -5.630844 -1.080703 0.825038
H  -5.621452 -0.999257 -0.948876
H  2.095507 -1.377225 0.817107
H  2.133995 -1.199062 -0.950397
H  -6.851325 1.140543 0.92004
H  -6.843609 1.219958 -0.85403
H  3.483417 0.943885 -0.689704
H  3.477425 0.729552 1.075582
H  -8.21318 -0.997231 0.817772
H  -8.206536 -0.916327 -0.956226
H  4.67717 -1.291818 -0.934346
H  4.69284 -1.451157 0.844723
H  -9.422118 1.305389 -0.857375
H  -9.430175 1.221613 0.915203
H  5.944734 0.942521 -0.442955
H  -10.827284 -0.908386 0.811829
H  -10.821683 -0.819542 -0.971559
H  -11.650204 0.444595 -0.017278
H  7.225847 -1.388848 -0.765592
H  7.369668 -1.221891 0.999606
H  10.320626 0.308344 -0.04674
