program: Gaussian 09
title: 000106532
version: EM64L-G09RevD.01
frameworkgroup: C1[X(C11H16O3)]
method: RPBEPBE
basis: SDD
operation: Freq
keyword: #pfreq=noraman
keyword: PBEPBE/SDD
title: #p freq=noraman PBEPBE/SDD
converged: YES YES NO NO
title: Mulliken charges:
elementType: O O O C C C C C C C C C C C H H H H H H H H H H H H H H H H
charge: -0.278565 -0.214842 -0.197544 -0.503139 -0.508496 0.301767 -0.045586 0.092978 -0.514111 0.100937 -0.694634 -0.701749 -0.799641 0.238121 0.237275 0.238592 0.257195 0.253835 0.202072 0.237735 0.224038 0.249962 0.207154 0.206975 0.204639 0.205002 0.268796 0.234436 0.238499 0.258300
chargesum: 0.00000
title: Mulliken charges with hydrogens summed into heavy atoms:
elementType: O O O C C C C C C C C C C C
charge: -0.278565 -0.214842 -0.197544 -0.027272 0.002533 0.301767 0.156486 0.092978 -0.052338 0.100937 -0.030543 -0.023311 -0.068406 0.238121
polarizability: 1.67316218e+02 1.03670415e+01 1.23314170e+02 9.11794922e-01 2.18239073e+00 9.85711871e+01
1716.lowfreq: -5.4651 -0.0008 -0.0008 -0.0005 7.4470 14.2271 27.9900 49.0651 65.8605
frequency: 23.8406 48.8657 65.8402 75.0168 102.4174 118.5170 124.5976 140.6127 154.3381 222.0791 234.8204 255.1005 284.5813 309.1286 320.6790 366.2469 391.1086 448.0329 461.9419 508.7468 528.4334 566.4229 603.2816 654.2895 693.9093 727.9821 783.5200 813.0102 821.0172 901.7916 913.3754 936.2381 958.7087 960.4965 966.0119 994.5194 1028.3886 1040.9932 1045.3342 1072.4088 1104.8986 1140.6375 1151.3942 1191.3291 1194.3891 1205.6603 1242.7740 1250.3891 1256.3824 1284.6164 1325.1205 1327.2129 1347.0901 1390.6190 1395.7782 1409.2587 1432.1204 1448.7616 1455.4125 1457.6943 1462.7369 1466.0384 1478.6312 1485.4708 1496.0293 1624.7752 1670.8499 1674.2596 2967.4998 2970.9144 2973.8635 2981.4051 2986.4387 3016.3121 3022.3627 3031.1980 3042.5321 3068.2251 3074.3860 3076.9951 3082.5250 3086.4881 3087.6457 3102.0006
redmass: 3.5526 4.2992 4.5858 3.6066 3.2367 1.2352 1.8912 2.9521 4.3331 1.2747 2.1542 1.0832 4.3993 5.4566 3.6929 2.2982 2.0162 3.2333 2.9866 3.9478 4.5029 4.1868 3.4037 6.1194 4.9773 5.1952 3.8056 1.5166 4.2876 1.6265 2.0351 1.2229 2.1321 1.6446 1.5526 3.1052 2.4318 1.8809 2.5525 3.4965 1.4728 1.2517 2.4729 2.1509 1.1309 2.8936 1.3122 1.4445 1.4397 2.4054 2.5671 1.7600 1.3795 1.2061 1.2987 1.2052 1.0807 1.1085 1.0678 1.0995 1.0493 1.0408 1.0560 1.0415 1.0539 11.2747 8.6727 9.9940 1.0796 1.0388 1.0372 1.0376 1.0598 1.0592 1.0638 1.0992 1.0959 1.1000 1.0993 1.1007 1.1016 1.1039 1.0995 1.0981
irintensity: 1.4284 1.5380 3.6262 2.9447 2.8920 0.3112 0.0259 0.3255 1.8471 0.0997 1.0541 0.0180 4.5139 4.9391 4.0110 1.9726 2.1944 2.6548 0.6935 0.8132 19.0852 0.7433 1.8968 10.2786 4.6116 10.1298 7.4261 7.6265 65.7789 3.4362 2.6797 3.0015 5.2961 3.4385 0.0608 15.0667 90.8863 46.5586 120.9471 133.9980 1.5368 1.9669 155.0142 28.6012 0.9471 51.7947 28.7968 9.9213 28.6693 14.0290 16.0005 10.4090 5.8115 23.5061 33.5128 16.2156 15.9556 8.9740 1.5548 29.1511 16.8954 0.9736 1.6681 19.8672 13.6829 281.5254 70.1405 116.0094 29.5017 14.4893 41.1525 31.8406 40.1085 23.3156 7.2566 7.7380 16.1232 22.6101 52.2231 7.1982 9.5494 20.4529 37.9031 11.3879
temp: 298.150 k
press: 1.00000 atm
elementType: 8 8 8 6 6 6 6 6 6 6 6 6 6 6 1 1 1 1 1 1 1 1 1 1 1 1 1 1 1 1
symmnumber: 1
zpe: 649618.7 jmol-1
zpe.correction: 0.247427 hartree
zpe.thermalcorrener: 0.262987 hartree
zpe.thermalcorrenthalpy: 0.263931 hartree
zpe.thermalcorrgfe: 0.203677 hartree
zpe.sumelectzpe: -653.357401 hartree
zpe.sumelectthermal: -653.341840 hartree
zpe.sumelectthermalent: -653.340896 hartree
zpe.sumelectthermalfe: -653.401150 hartree
dipole: -3.1745 -2.6280 -1.3818
dipole: 4.3467
quadrupole: -63.6934 -84.4344 -88.9292
quadrupole: -2.7542 -1.4273 0.7392
quadrupole: 15.3256 -5.4154 -9.9102 -2.7542 -1.4273 0.7392
hfenergy: -653.6048273 hartree
pointgroup: C01 [X(C11H16O3)]
dipole: 1.1892188 -1.2009446 0.2607038 debye
polarizability: 166.159225|-12.4681523|123.926073|-1.5300775|4.3204095|99.1162776 unknown
InChI: InChI=1S/C11H16O3/c1-7(2)6-10(13)14-11-8(3)4-5-9(11)12/h7H,4-6H2,1-3H3
charge 0 multiplicity 1
30 atoms
O  -0.069827 -1.021402 0.263561
O  0.292613 1.92317 0.656267
O  -0.784885 -0.049048 -1.748291
C  3.478587 0.154762 0.096456
C  2.732688 1.507436 0.274174
C  2.384949 -0.904252 0.024607
C  -3.346853 -0.229784 0.352904
C  1.155321 -0.326694 0.186301
C  -2.402857 -1.280821 -0.333025
C  1.2455 1.140291 0.400431
C  -3.688827 0.944144 -0.593453
C  -2.772665 0.280194 1.69516
C  2.674464 -2.35948 -0.189513
C  -1.064385 -0.703278 -0.72866
H  4.164801 -0.052937 0.940557
H  4.098251 0.132702 -0.820556
H  2.863267 2.174823 -0.596655
H  3.056557 2.071502 1.165879
H  -4.282249 -0.789927 0.562889
H  -2.243504 -2.128383 0.355336
H  -2.893463 -1.645086 -1.253937
H  -2.790736 1.545578 -0.819639
H  -4.434004 1.609444 -0.119809
H  -4.10726 0.58579 -1.55236
H  -3.517959 0.914943 2.209603
H  -2.512747 -0.557196 2.369405
H  -1.862933 0.886534 1.53356
H  3.345245 -2.749045 0.600827
H  3.198453 -2.515204 -1.152732
H  1.750059 -2.959179 -0.191783
