program: Gaussian 09
title: 000106548
version: EM64L-G09RevD.01
frameworkgroup: C1[X(C12H25NO4)]
method: RPBEPBE
basis: SDD
operation: Freq
keyword: #p
keyword: freq=noraman
keyword: PBEPBE/SDD
title: #p freq=noraman PBEPBE/SDD
converged: YES YES NO NO
title: Mulliken charges:
elementType: O O O O N C C C C C C C C C C C C H H H H H H H H H H H H H H H H H H H H H H H H H
charge: -0.282111 -0.467425 -0.481815 -0.238158 -0.570821 0.326031 -0.389622 -0.358330 -0.423997 -0.393818 -0.743527 -0.371503 -0.525116 -0.354780 0.257575 -0.359169 -0.390509 0.227166 0.211799 0.224914 0.263294 0.237843 0.194288 0.212542 0.224298 0.234837 0.216677 0.220684 0.224647 0.207388 0.241323 0.239109 0.184962 0.185630 0.182445 0.221677 0.348790 0.350038 0.205547 0.176149 0.271945 0.259102
chargesum: 0.00000
title: Mulliken charges with hydrogens summed into heavy atoms:
elementType: O O O O N C C C C C C C C C C C C
charge: -0.282111 -0.118634 -0.131777 -0.238158 -0.039774 0.326031 0.049343 0.129877 0.008134 0.043022 -0.071329 0.060533 -0.044684 0.015812 0.257575 0.044953 -0.008813
polarizability: 1.92597774e+02 -3.73544539e-01 1.31270968e+02 3.17242131e-01 1.69023866e+00 1.33339638e+02
1716.lowfreq: -6.0493 -0.0009 -0.0006 0.0004 6.2359 9.3437 19.8630 22.2661 31.6697
frequency: 13.2856 21.8582 31.5184 40.1609 45.5818 63.6087 77.5110 91.3803 93.8363 113.2210 133.4909 144.7584 150.8681 166.0962 178.0225 191.4148 207.0055 230.6861 237.3000 244.8550 269.0435 286.1332 308.3796 320.3019 322.8710 378.7584 395.0707 462.1732 500.1637 531.4274 552.9457 553.7058 599.9309 677.1400 727.6812 753.5058 761.7068 781.6611 832.2522 860.8932 876.3094 903.8031 929.8234 937.2209 958.2944 963.7205 970.5307 990.2416 1003.5794 1029.9774 1050.4502 1058.3319 1062.5953 1080.0080 1090.8065 1105.5424 1122.0966 1126.9337 1133.8669 1145.4873 1168.7212 1192.3186 1202.6223 1216.1100 1225.9872 1242.6022 1257.2563 1273.5827 1276.4576 1280.9345 1285.3092 1292.3727 1303.5730 1309.5733 1345.9235 1356.8473 1363.6295 1369.9938 1388.9692 1390.0683 1394.4962 1414.5910 1440.0646 1458.6805 1463.5238 1464.9570 1466.6025 1466.9766 1480.3503 1481.9241 1485.7697 1493.6125 1494.2389 1637.6964 1640.0306 2859.9708 2950.1147 2955.8112 2960.2034 2971.8685 2979.1651 2982.0910 2991.6491 2997.4999 2999.3574 3005.2746 3016.1258 3023.4625 3032.2601 3034.2712 3044.4906 3051.0481 3064.0694 3072.2705 3083.2364 3084.8823 3451.8645 3579.7573 3589.6462 3594.3309
redmass: 3.7588 5.7037 2.9351 3.3334 2.7793 2.9581 2.3997 3.6832 3.6584 2.2136 2.2973 2.1727 3.5922 1.9660 3.5991 1.4624 3.1568 1.1759 1.3813 1.4207 4.8090 2.1959 2.4296 2.6718 2.2992 4.1277 4.1558 3.3844 3.6640 2.5030 2.9589 2.9223 1.2891 4.7264 1.1065 2.4512 1.1895 1.3259 1.3020 2.2859 6.3980 2.1713 2.0472 1.8660 2.9356 2.2352 2.1482 5.7274 1.7576 3.1123 2.8660 1.8954 2.1458 2.0631 2.6457 1.9792 1.7097 1.7046 2.4993 1.5471 1.6762 1.1688 1.5188 1.0899 1.3183 1.1711 1.3824 1.3730 1.1695 1.0852 1.8011 1.1060 1.3760 1.3121 1.4992 1.4867 1.6462 1.5944 1.2654 1.4627 1.3411 1.3690 1.0857 1.0807 1.0706 1.0675 1.0733 1.0824 1.0706 1.0941 1.0586 1.0906 1.0544 1.0974 9.6701 1.0716 1.0596 1.0586 1.0655 1.0544 1.0638 1.0358 1.0736 1.0839 1.0602 1.0856 1.0575 1.1030 1.0963 1.1089 1.1004 1.1007 1.1021 1.0986 1.1027 1.1043 1.0447 1.0975 1.0667 1.0668
irintensity: 0.1910 0.2339 2.4516 0.7166 0.6334 0.3349 1.0933 3.3433 2.1165 1.1729 41.8525 2.3877 6.6671 36.3977 5.6491 80.7552 5.4995 128.8526 45.6739 31.4631 6.2588 1.6971 15.1369 7.0617 7.3005 9.9905 4.2671 20.0916 2.2097 4.9552 13.7838 2.8663 227.4254 2.9182 12.6394 16.9263 0.4185 30.9474 1.4934 8.1079 13.8289 2.6401 49.1089 53.1112 53.6793 16.3824 34.5671 31.9594 5.7693 2.1477 51.0646 9.1919 8.3729 18.5971 48.1820 7.5932 12.0134 41.3906 288.1108 15.9864 0.4365 12.6516 28.2615 5.1897 16.5424 0.9924 37.4485 4.9314 14.1837 2.1593 14.5791 5.3800 15.1184 8.3322 16.3816 3.5625 5.0122 9.6712 7.2330 20.9694 9.6423 0.7950 19.7483 4.1104 1.9555 0.1415 5.6029 1.3485 18.0452 14.4130 18.3624 6.8359 12.7947 43.1271 174.9567 115.7820 16.3663 56.6512 39.6511 32.3249 5.1881 32.4633 20.2754 29.8369 30.2104 38.3945 22.8407 30.8565 3.3312 34.0593 38.1108 6.8009 84.4135 53.3897 42.2986 30.8817 1.9093 0.1702 4.5626 3.4287
temp: 298.150 k
press: 1.00000 atm
elementType: 8 8 8 8 7 6 6 6 6 6 6 6 6 6 6 6 6 1 1 1 1 1 1 1 1 1 1 1 1 1 1 1 1 1 1 1 1 1 1 1 1 1
symmnumber: 1
zpe: 952783.2 jmol-1
zpe.correction: 0.362896 hartree
zpe.thermalcorrener: 0.385318 hartree
zpe.thermalcorrenthalpy: 0.386263 hartree
zpe.thermalcorrgfe: 0.307847 hartree
zpe.sumelectzpe: -826.482626 hartree
zpe.sumelectthermal: -826.460204 hartree
zpe.sumelectthermalent: -826.459260 hartree
zpe.sumelectthermalfe: -826.537675 hartree
dipole: -0.7809 0.2358 -2.8351
dipole: 2.9501
quadrupole: -87.2981 -100.2907 -109.1623
quadrupole: 12.4739 -13.5043 6.9606
quadrupole: 11.6189 -1.3737 -10.2452 12.4739 -13.5043 6.9606
hfenergy: -826.8455223 hartree
pointgroup: C01 [X(C12H25N1O4)]
dipole: -0.3145335 -0.0609973 1.1155788 debye
polarizability: 192.6006175|-0.2472855|131.3580653|0.0451172|1.7429128|133.2496968 unknown
InChI: InChI=1S/C12H25NO4/c1-2-12(8-14,9-15)10-17-11(16)6-4-3-5-7-13/h14-15H,2-10,13H2,1H3
charge 0 multiplicity 1
42 atoms
O  -0.835874 0.075424 0.008428
O  -5.712094 -0.199485 0.16827
O  -3.345519 2.447218 0.279551
O  0.420749 0.267183 -1.943874
N  7.921052 -0.278018 0.11031
C  -3.28156 0.00769 0.152628
C  -3.212824 -1.283718 1.023751
C  -2.082015 0.123682 -0.810203
C  -4.559582 0.031496 -0.72119
C  -3.303453 1.224545 1.107579
C  -3.223636 -2.616901 0.245072
C  2.90184 -0.017477 -0.438227
C  1.546322 0.190664 0.265213
C  4.089837 0.065815 0.545028
C  0.367413 0.18223 -0.695571
C  5.453772 -0.14153 -0.149431
C  6.645227 -0.075077 0.827449
H  -4.079053 -1.269671 1.710806
H  -2.295655 -1.2308 1.640805
H  -2.051698 -0.705375 -1.539883
H  -2.100934 1.082951 -1.355487
H  -4.635058 1.020083 -1.215532
H  -4.507996 -0.764755 -1.49339
H  -2.389438 1.211287 1.734472
H  -4.205584 1.156356 1.746955
H  -4.151641 -2.73648 -0.342124
H  -3.170831 -3.465492 0.951397
H  -2.362147 -2.708126 -0.441594
H  3.01797 0.738357 -1.23746
H  2.905341 -1.001862 -0.945968
H  1.371851 -0.576721 1.042872
H  1.536634 1.164515 0.796618
H  3.963175 -0.692513 1.346649
H  4.082956 1.055762 1.048565
H  5.456696 -1.127795 -0.661472
H  5.605337 0.622168 -0.936132
H  -6.542238 0.053358 -0.304993
H  -3.344345 3.24171 0.867032
H  6.672609 0.929518 1.293256
H  6.468162 -0.807449 1.655401
H  8.758813 -0.090243 0.669449
H  7.981019 -1.179224 -0.375227
