program: Gaussian 09
title: 000106530
version: EM64L-G09RevD.01
frameworkgroup: C1[X(C14H26O4S)]
method: RPBEPBE
basis: SDD
operation: Freq
keyword: #p
keyword: freq=noraman
keyword: PBEPBE/SDD
title: #p freq=noraman PBEPBE/SDD
converged: YES YES NO NO
title: Mulliken charges:
elementType: S O O O O C C C C C C C C C C C C C C H H H H H H H H H H H H H H H H H H H H H H H H H H
charge: 0.003633 -0.266508 -0.259588 -0.242508 -0.252354 -0.032314 -0.024086 -0.356362 -0.387415 -0.334344 -0.291930 -0.722864 -0.710147 -0.711296 -0.706126 -0.635368 -0.479488 0.368175 0.276459 0.253379 0.196024 0.189064 0.212360 0.205289 0.216009 0.218914 0.244644 0.225995 0.238309 0.211317 0.249882 0.193300 0.211337 0.216337 0.197780 0.207816 0.220409 0.215447 0.207674 0.214958 0.215808 0.321950 0.269241 0.284629 0.126562
chargesum: 0.00000
title: Mulliken charges with hydrogens summed into heavy atoms:
elementType: S O O O O C C C C C C C C C C C C C C
charge: 0.130195 -0.266508 -0.259588 -0.242508 -0.252354 0.221065 0.171937 0.045061 0.033883 0.129214 0.172373 -0.068366 -0.084693 -0.067624 -0.067686 -0.313418 0.074383 0.368175 0.276459
polarizability: 2.13870839e+02 -6.17669266e+00 1.92015735e+02 -9.76275990e+00 -2.97568679e+00 1.43698718e+02
1716.lowfreq: -6.6658 -0.0006 0.0017 0.0019 2.7549 3.4184 16.5260 21.0905 29.3305
frequency: 16.2258 20.7296 28.8909 35.2068 48.2294 54.8562 62.1380 70.8040 81.4739 105.3313 117.1132 132.0948 137.1592 172.2955 181.4247 197.6534 201.4085 208.4749 215.2560 230.7571 234.7783 245.4381 252.3417 279.7493 316.1862 329.7408 354.5095 377.2369 381.7277 410.0495 434.6027 440.3763 496.6422 531.5876 539.9332 592.8646 648.8195 675.6121 754.7632 765.1906 776.4775 785.6593 814.4514 831.4126 845.0683 887.5172 910.1079 913.7357 916.4488 925.7635 932.0169 943.8167 954.3740 957.7108 981.3025 982.4354 1006.0427 1046.0722 1079.3271 1106.0954 1126.5216 1136.9747 1141.0349 1150.8950 1151.8428 1152.5296 1178.2305 1179.0464 1182.6448 1207.5092 1211.1175 1228.6880 1249.8095 1275.8381 1277.8085 1314.8886 1323.3144 1329.3460 1332.6995 1338.4148 1348.6104 1360.9319 1361.9021 1373.8736 1377.0986 1379.9108 1395.5923 1397.1590 1427.5263 1441.8376 1460.2980 1462.5430 1465.7238 1469.5878 1473.6400 1474.3122 1480.3728 1480.5560 1484.3102 1490.8543 1498.0407 1626.2904 1640.0512 2445.8199 2958.4740 2961.9312 2964.2934 2968.7315 2969.1773 2971.9586 2985.9867 2992.4567 3005.1367 3020.3232 3023.2517 3034.3994 3041.4153 3056.0308 3061.9526 3064.3617 3068.4411 3070.4092 3070.9389 3074.4820 3076.2280 3079.0538 3081.4830 3095.6976 3100.8862
redmass: 4.1864 3.9784 2.9030 4.0627 5.8686 4.6913 3.1085 3.5166 7.5357 2.2248 3.3293 6.2006 3.1448 3.3274 5.0244 1.2226 1.2019 1.1063 1.9736 2.1504 1.4857 1.3757 1.9886 7.0949 2.8122 3.1811 2.8675 2.1547 2.4050 2.0779 2.6504 2.4334 2.8314 2.7189 3.5407 6.8350 6.0420 6.3011 2.6310 3.6566 1.4772 2.6631 1.9264 1.6994 2.2366 4.6898 1.9757 2.1006 1.1737 1.2880 2.0742 1.9964 1.5806 1.3635 1.6553 2.5330 1.6962 2.2423 2.9946 3.7166 2.4278 2.0798 2.3540 2.1424 1.6342 2.1755 1.6803 1.7794 1.4351 1.3918 1.3770 1.2464 1.2955 1.1600 1.2201 1.5151 1.2098 1.4504 1.4144 1.4192 1.5422 1.5092 1.4481 1.5166 1.2067 1.2724 1.2175 1.2171 1.0919 1.0856 1.0777 1.0879 1.0541 1.0485 1.0589 1.0495 1.0621 1.0760 1.0639 1.0494 1.0493 9.5734 9.3506 1.0382 1.0830 1.0578 1.0385 1.0396 1.0356 1.0364 1.0602 1.0813 1.0577 1.0605 1.0837 1.0723 1.1016 1.0986 1.0995 1.0984 1.1005 1.0991 1.0990 1.0992 1.0976 1.0993 1.1066 1.0887 1.1084
irintensity: 0.3177 0.6297 0.1665 0.5383 1.2184 0.4527 0.3085 0.1521 1.3500 0.1826 0.6519 1.9054 1.2739 7.1147 1.4477 1.0742 22.7006 6.9242 3.3208 5.1472 1.8631 1.4325 3.2002 12.8801 2.5154 15.3378 4.6268 1.7439 6.1561 3.7745 1.6490 9.8788 4.3860 0.6773 8.2129 13.6424 7.2165 2.9431 3.4540 5.8423 4.8801 4.0046 0.9521 5.6217 7.4030 17.3781 0.2335 18.3969 3.0847 10.5539 4.8830 48.9142 15.7409 0.2627 2.3256 27.7978 6.0621 21.2717 26.7222 123.5017 358.1052 33.1243 1.6896 109.3558 4.9300 91.9241 18.6307 8.7019 40.7305 28.5378 1.9984 6.7459 4.5898 2.3522 0.4781 110.7328 2.2528 6.5535 4.4555 13.1389 45.7966 3.0525 18.1875 13.7584 17.9282 10.7066 19.0404 13.3272 42.7113 4.8441 0.9558 14.3692 4.8082 1.9404 7.1534 14.2114 5.0519 10.6813 3.6434 27.3409 20.1439 229.7781 124.1762 17.8263 15.9194 19.8600 47.2863 38.1525 37.5332 22.2045 20.4548 7.1681 22.9011 9.5589 16.8279 44.2684 4.7900 15.5926 10.6002 70.2659 26.0912 73.2241 45.4474 73.2580 0.5455 36.1503 55.2301 1.8319 13.8290
temp: 298.150 k
press: 1.00000 atm
elementType: 16 8 8 8 8 6 6 6 6 6 6 6 6 6 6 6 6 6 6 1 1 1 1 1 1 1 1 1 1 1 1 1 1 1 1 1 1 1 1 1 1 1 1 1 1
symmnumber: 1
zpe: 993373.1 jmol-1
zpe.correction: 0.378356 hartree
zpe.thermalcorrener: 0.402746 hartree
zpe.thermalcorrenthalpy: 0.403690 hartree
zpe.thermalcorrgfe: 0.320696 hartree
zpe.sumelectzpe: -1246.509464 hartree
zpe.sumelectthermal: -1246.485073 hartree
zpe.sumelectthermalent: -1246.484129 hartree
zpe.sumelectthermalfe: -1246.567123 hartree
dipole: -0.9636 0.9640 -1.1897
dipole: 1.8092
quadrupole: -102.3871 -127.9674 -129.1615
quadrupole: 1.2211 -2.2995 4.1091
quadrupole: 17.4516 -8.1287 -9.3228 1.2211 -2.2995 4.1091
hfenergy: -1246.8878195 hartree
pointgroup: C01 [X(C14H26O4S1)]
dipole: 0.4745345 0.1690321 0.502897 debye
polarizability: 215.5055375|-0.0962879|187.5376663|-8.1464431|12.7356002|146.5420879 unknown
InChI: InChI=1S/C14H26O4S/c1-10(2)5-7-17-13(15)9-12(19)14(16)18-8-6-11(3)4/h10-12,19H,5-9H2,1-4H3
charge 0 multiplicity 1
45 atoms
S  -3.461592 -2.667857 -0.234055
O  -3.344227 0.645516 0.229807
O  1.598622 -1.614635 -0.419076
O  -1.998484 0.31473 -1.658908
O  0.328557 -0.037056 0.733361
C  -1.598595 3.214615 0.544487
C  5.380566 -0.920534 -0.50018
C  -3.142845 3.081233 0.637435
C  4.015642 -1.647781 -0.648681
C  -3.770752 2.000394 -0.251925
C  2.842222 -0.84922 -0.080903
C  -1.136884 3.65096 -0.86707
C  -1.101768 4.216336 1.614157
C  5.754516 -0.668214 0.981646
C  6.489379 -1.734143 -1.208614
C  -2.09333 -1.381546 0.137441
C  -0.769251 -1.95814 -0.375911
C  -2.439756 -0.06615 -0.551325
C  0.404096 -1.085973 0.049083
H  -1.147007 2.226743 0.766559
H  5.300716 0.064652 -1.008326
H  -3.608677 4.050501 0.356797
H  -3.433208 2.881427 1.687986
H  4.066227 -2.633463 -0.145067
H  3.81971 -1.842785 -1.720636
H  -4.869866 1.991363 -0.158892
H  -3.48176 2.099329 -1.311959
H  2.761116 0.15651 -0.534328
H  2.884677 -0.734207 1.016359
H  -0.040341 3.79154 -0.886547
H  -1.384397 2.893904 -1.632144
H  -1.605872 4.612946 -1.154754
H  -1.399606 3.90136 2.632089
H  0.000492 4.298608 1.5941
H  -1.519311 5.226706 1.433765
H  5.776515 -1.621354 1.544782
H  5.040049 0.008161 1.485379
H  6.756909 -0.208298 1.058595
H  6.614575 -2.724246 -0.729202
H  7.461198 -1.209605 -1.157013
H  6.248517 -1.902296 -2.274788
H  -2.073949 -1.226862 1.2263
H  -0.612573 -2.981426 0.010608
H  -0.778621 -2.020511 -1.478977
H  -4.460931 -1.984133 0.439246
