program: Gaussian 09
title: 000106471
version: EM64L-G09RevD.01
frameworkgroup: C1[X(C13H18N2O3)]
method: RPBEPBE
basis: SDD
operation: Freq
keyword: #p
keyword: freq=noraman
keyword: PBEPBE/SDD
title: #p freq=noraman PBEPBE/SDD
converged: YES YES NO NO
title: Mulliken charges:
elementType: O O O N N C C C C C C C C C C C C C H H H H H H H H H H H H H H H H H H
charge: -0.291433 -0.253736 -0.237465 -0.179892 0.008738 -0.387266 -0.333358 -0.461517 -0.457625 0.294757 0.238007 -0.562008 0.439923 -0.558972 0.230918 -0.793681 -0.235747 -0.689362 0.222298 0.242753 0.230233 0.246718 0.226997 0.232735 0.223313 0.233116 0.252975 0.303455 0.252196 0.251872 0.205798 0.216731 0.218765 0.217296 0.227537 0.224930
chargesum: 0.00000
title: Mulliken charges with hydrogens summed into heavy atoms:
elementType: O O O N N C C C C C C C C C C C C C
charge: -0.291433 -0.253736 -0.237465 -0.179892 0.008738 0.077785 0.143592 -0.001785 -0.001197 0.294757 0.238007 -0.309033 0.439923 -0.255516 0.230918 -0.083815 0.199749 -0.019598
polarizability: 2.90703981e+02 3.91667171e+00 1.95315763e+02 1.51349138e+00 2.45012137e+00 9.58253263e+01
1716.lowfreq: -11.0136 -0.0006 -0.0004 0.0007 5.3607 9.8236 32.7792 47.5805 61.4614
frequency: 32.7517 47.5615 61.3092 69.8468 96.7213 112.6443 116.9570 139.4425 167.0359 198.4415 215.8700 244.1316 248.5526 254.1118 267.5001 272.2404 301.6799 323.8054 336.8365 381.7563 432.3523 466.8597 498.6934 533.9471 571.1774 595.5271 620.6999 661.6125 695.8200 717.4338 725.1204 739.7358 792.9305 827.2867 840.9542 858.3797 867.9985 875.3652 895.3878 923.4506 924.5911 934.1680 984.0958 1013.7909 1036.2915 1040.7301 1052.1884 1072.9692 1113.3671 1115.4141 1131.1858 1136.5774 1162.7486 1170.9105 1185.1151 1197.1087 1214.5486 1229.4374 1243.6332 1264.9261 1288.6100 1300.9928 1308.5633 1315.4370 1332.6421 1342.3455 1355.2901 1368.9710 1396.6684 1403.1339 1408.4211 1432.1403 1450.1055 1463.2447 1468.1135 1471.7129 1476.9653 1477.9776 1485.0790 1489.6657 1492.2609 1525.7686 1560.2149 1612.5216 2942.3139 2961.7330 2992.2337 2995.6496 3003.2838 3008.8678 3009.8838 3020.6060 3025.2090 3079.4114 3080.9398 3087.9483 3089.9575 3093.6307 3098.6284 3102.4790 3166.7970 3187.3466
redmass: 4.0250 8.3256 3.4648 3.2808 3.2565 3.4396 1.6714 4.3465 4.5041 2.8728 1.0964 1.2477 2.9176 2.2958 4.4452 3.7277 4.7824 3.8614 3.3756 5.7034 6.5168 3.4545 6.4127 5.8019 1.9126 5.2950 4.2744 5.6080 9.2300 3.4720 3.3345 6.2593 3.6165 1.1191 1.6001 1.7589 1.8419 3.1215 1.3766 2.6864 1.4957 3.2615 1.7572 1.6023 2.4019 1.5330 3.0957 1.9675 1.9342 1.8051 3.3086 1.4438 1.6434 1.5245 3.1778 4.9438 3.5377 1.2995 1.2756 1.1367 1.3528 2.6458 1.6639 1.2677 1.9738 1.4039 2.8947 1.4529 1.4299 1.4973 2.3645 2.6113 1.0465 1.0409 1.0887 1.0976 1.1849 1.2485 1.0913 1.1140 1.1053 3.8486 9.2144 6.5468 1.0653 1.0558 1.0364 1.0361 1.0677 1.0733 1.0624 1.1075 1.0869 1.0989 1.0961 1.1011 1.1010 1.0989 1.1037 1.1015 1.0895 1.0899
irintensity: 0.8736 0.0106 0.1004 2.2877 1.3654 1.7923 3.8567 0.7989 0.0447 6.9456 0.2262 0.8102 1.3688 0.9772 0.8875 2.1303 0.3902 0.3828 2.0777 1.8554 0.4479 0.7026 0.5773 2.2888 3.5282 4.1267 5.6349 5.0525 5.7830 2.3951 2.7404 7.5925 1.5924 6.4979 21.1408 6.7414 1.3132 19.0140 23.9753 7.9994 4.0481 51.6303 4.6944 6.2794 52.9076 9.0903 25.5816 1.2874 1.1403 7.0593 8.5420 4.8777 31.4449 15.5068 170.0677 334.2861 534.0971 39.0609 22.6061 0.0210 3.7713 55.8866 9.2325 0.6280 72.7323 23.4085 190.0884 36.8660 23.6544 33.7831 20.2265 24.2283 10.7116 13.9926 11.3073 55.3408 36.5041 9.1033 1.6587 29.5909 29.8501 175.6176 138.9003 232.2509 53.8575 26.1755 24.1851 18.2965 41.8094 18.0153 23.5511 24.3696 53.0280 39.6873 8.4399 20.0933 20.6024 25.1780 42.9850 41.2420 12.3052 7.4147
temp: 298.150 k
press: 1.00000 atm
elementType: 8 8 8 7 7 6 6 6 6 6 6 6 6 6 6 6 6 6 1 1 1 1 1 1 1 1 1 1 1 1 1 1 1 1 1 1
symmnumber: 1
zpe: 774148.3 jmol-1
zpe.correction: 0.294858 hartree
zpe.thermalcorrener: 0.312614 hartree
zpe.thermalcorrenthalpy: 0.313558 hartree
zpe.thermalcorrgfe: 0.248615 hartree
zpe.sumelectzpe: -839.905436 hartree
zpe.sumelectthermal: -839.887680 hartree
zpe.sumelectthermalent: -839.886736 hartree
zpe.sumelectthermalfe: -839.951679 hartree
dipole: -9.2783 -0.5772 -0.1104
dipole: 9.2969
quadrupole: -129.1570 -91.3712 -107.0094
quadrupole: -0.4327 -1.0845 -0.1105
quadrupole: -19.9778 17.8080 2.1698 -0.4327 -1.0845 -0.1105
hfenergy: -840.200294 hartree
pointgroup: C01 [X(C13H18N2O3)]
dipole: 3.6495586 0.2241452 -0.0949217 debye
polarizability: 290.6419679|3.7477477|194.9112922|-3.9026075|-6.8184724|96.2918102 unknown
InChI: InChI=1S/C13H18N2O3/c1-3-18-13-9-11(15(16)17)10(2)8-12(13)14-6-4-5-7-14/h8-9H,3-7H2,1-2H3
charge 0 multiplicity 1
36 atoms
O  0.997577 -1.899329 0.114882
O  -3.949355 -1.401205 0.321043
O  -4.452394 0.816397 0.144479
N  2.041243 0.754289 -0.004097
N  -3.587365 -0.153638 0.204707
C  2.576688 2.11922 -0.254394
C  3.141102 -0.205123 0.320428
C  4.101805 1.910323 -0.373456
C  4.360706 0.709977 0.568899
C  0.678861 0.512708 0.041834
C  0.101098 -0.813271 0.127799
C  -0.244051 1.604833 -0.017298
C  -1.647994 1.474335 0.026853
C  -1.284576 -0.970421 0.185582
C  -2.160638 0.148474 0.139905
C  -2.49047 2.733983 -0.037291
C  0.419256 -3.25903 0.139769
C  1.584528 -4.242052 0.067722
H  2.333626 2.79786 0.591308
H  2.134969 2.55051 -1.172396
H  3.317676 -0.893323 -0.526546
H  2.877266 -0.817516 1.195666
H  4.369454 1.645089 -1.412537
H  4.666382 2.814652 -0.092049
H  4.376916 1.049623 1.621076
H  5.312295 0.193214 0.359977
H  0.156466 2.619201 -0.085824
H  -1.751877 -1.954421 0.253732
H  -3.180563 2.71579 -0.898223
H  -3.135677 2.837297 0.851894
H  -1.839207 3.621871 -0.115386
H  -0.165249 -3.391733 1.072798
H  -0.265313 -3.379717 -0.724378
H  1.200608 -5.278127 0.080678
H  2.162604 -4.097156 -0.860995
H  2.263605 -4.113083 0.928139
