program: Gaussian 09
title: 000106443
version: EM64L-G09RevD.01
frameworkgroup: C1[X(C7H10N2O)]
method: RPBEPBE
basis: SDD
operation: Freq
keyword: #p
keyword: freq=noraman
keyword: PBEPBE/SDD
title: #p freq=noraman PBEPBE/SDD
converged: YES YES NO NO
title: Mulliken charges:
elementType: O N N C C C C C C C H H H H H H H H H H
charge: -0.257824 -0.013298 -0.026962 -0.470511 0.277820 -0.674897 -0.442235 0.190658 -0.387720 -0.510806 0.205168 0.225149 0.244686 0.218139 0.213376 0.246167 0.254214 0.238563 0.232041 0.238271
chargesum: 0.00000
title: Mulliken charges with hydrogens summed into heavy atoms:
elementType: O N N C C C C C C C
charge: -0.257824 -0.013298 -0.026962 -0.040194 0.277820 0.001305 -0.196068 0.190658 -0.133506 0.198069
polarizability: 1.36917242e+02 -3.68752185e+00 8.74590882e+01 -4.26220109e+00 -2.67442493e-01 5.47453621e+01
1716.lowfreq: -13.6339 -2.7496 -0.0002 0.0003 0.0004 9.7350 43.3064 78.3289 128.5017
frequency: 43.3016 78.3179 128.5011 157.2641 185.4394 218.5063 225.8375 344.5419 388.2775 422.5288 433.6944 535.7338 583.0250 620.9599 710.1043 773.1369 791.2828 824.8387 893.5904 931.0787 952.4377 969.1870 989.4257 1058.2038 1068.2687 1113.0601 1142.5719 1224.2161 1232.2427 1249.0610 1285.5825 1293.4498 1308.0726 1341.5467 1383.6983 1419.5558 1450.4623 1458.7466 1463.2689 1464.8977 1473.2915 1488.6038 1498.6448 1546.7303 2984.4933 2992.7776 3000.4949 3047.2179 3081.9269 3095.7484 3101.1466 3137.7922 3142.6720 3156.7695
redmass: 2.8148 3.3394 2.3098 1.3430 1.8203 3.3132 1.4350 2.3625 5.2553 4.0378 4.5734 4.1607 3.8733 10.0707 4.3108 2.1351 1.7434 6.2161 1.5858 1.3279 7.3625 2.9696 2.7249 1.7630 1.7903 1.2541 1.4117 4.2434 1.5313 1.9967 3.2974 1.7031 1.9991 1.8480 1.1984 1.3477 1.0507 1.9018 1.1128 1.1263 1.0459 1.1150 5.2409 5.6860 1.0349 1.0599 1.0293 1.1013 1.1006 1.1009 1.1043 1.0928 1.1047 1.0929
irintensity: 1.2138 0.8782 2.9451 1.1542 3.9907 2.2174 2.2738 3.1513 5.3550 13.6806 1.6453 3.8167 4.0416 0.1944 11.1785 3.9257 2.9108 0.3428 26.5671 1.3342 29.4343 20.6919 26.5005 3.1727 10.0897 0.1875 7.5098 30.9988 2.8505 53.1228 69.5022 19.8894 80.9168 32.5306 10.6249 35.5338 13.4538 115.9633 31.8829 3.0519 13.8369 13.6928 88.6567 18.7902 41.1420 28.6807 47.2638 8.8391 50.0775 30.9510 29.8826 33.0655 16.9996 7.4657
temp: 298.150 k
press: 1.00000 atm
elementType: 8 7 7 6 6 6 6 6 6 6 1 1 1 1 1 1 1 1 1 1
symmnumber: 1
zpe: 424113.4 jmol-1
zpe.correction: 0.161536 hartree
zpe.thermalcorrener: 0.171539 hartree
zpe.thermalcorrenthalpy: 0.172483 hartree
zpe.thermalcorrgfe: 0.125663 hartree
zpe.sumelectzpe: -456.691238 hartree
zpe.sumelectthermal: -456.681236 hartree
zpe.sumelectthermalent: -456.680292 hartree
zpe.sumelectthermalfe: -456.727111 hartree
dipole: -0.3771 -1.5979 0.1696
dipole: 1.6505
quadrupole: -50.8314 -60.8594 -60.2641
quadrupole: -1.2776 -0.8597 0.3930
quadrupole: 6.4869 -3.5411 -2.9458 -1.2776 -0.8597 0.3930
hfenergy: -456.8527746 hartree
pointgroup: C01 [X(C7H10N2O1)]
dipole: -0.1380058 -0.6261975 -0.1025538 debye
dipolederiv: -1.7882385 -0.1358067 0.0962892 -0.0383888 -0.3484065 -0.0018543 0.1513111 0.0072843 -0.3291298 -0.180056 -0.1391469 -0.0465591 -0.0439468 -0.1200243 0.0556225 -0.0205803 0.0587339 -0.2267038 -0.5700271 -0.1564276 -0.0150935 0.3795694 -0.2448839 -0.042064 0.132851 0.0141503 -0.2288877 -0.0956574 0.02053 -0.0293086 -0.1162531 0.1685816 0.0169221 -0.125434 0.0090372 0.0701295 0.5778637 -0.1704225 -0.0492921 0.2077628 -0.2408544 -0.1117158 -0.0245902 -0.0532304 -0.0192165 -0.0087224 0.0035786 -0.0405411 0.04474 0.0572896 -0.0339644 0.0776425 -0.0389323 0.0150879 -0.0000137 0.2211905 0.028038 -0.3043057 0.2939847 0.1153497 -0.0731845 0.0533132 -0.0358972 1.7400465 -0.1238349 -0.1728821 -0.1852595 -0.0697922 -0.0515643 -0.2078951 -0.0595563 0.237082 -0.3719037 0.1823394 0.0655706 -0.365753 0.2893765 0.0980036 -0.0486755 0.0559069 -0.0242033 0.6848908 0.1393993 -0.0037539 0.3597075 0.3558248 -0.0118566 0.0394654 0.0042337 0.2698443 0.0359188 -0.0140305 -0.0158766 0.0687768 -0.1180954 -0.1226866 0.0006051 -0.0818065 0.0271091 -0.017874 -0.0222551 0.0409794 -0.0455473 0.0070376 0.1218032 0.056205 0.0785497 -0.038312 0.1249171 0.0589347 0.0227081 0.0145888 -0.0734085 -0.0916875 0.0101108 -0.0563752 0.0457794 -0.2560397 0.0170446 0.005313 0.0139921 0.109318 -0.0039321 0.0006874 -0.00274 0.0643104 0.0848608 -0.0715648 0.04742 -0.0301055 -0.0342443 0.1331044 0.0001191 0.0956598 -0.0545071 0.044051 0.0632619 0.0275834 0.1020235 -0.0527786 -0.0517598 0.0343728 -0.0487392 0.1102158 0.0609179 0.050262 0.0168245 0.0761086 -0.0297359 -0.0426337 0.0228607 -0.0409514 0.1186796 0.0418308 -0.0025642 0.039189 -0.122689 0.0363353 -0.0529487 -0.0462465 -0.0752957 -0.1034433 -0.1395528 0.0390857 0.0357059 0.0925686 0.0618451 -0.0242066 0.0503714 -0.018507 0.1132081 0.0327878 0.0404265 -0.0523142 -0.1075894 -0.0473692 0.1020688 -0.0299964 0.0992648 -0.0111454 unknown
polarizability: 137.0655713|-1.7230501|85.260986|-4.4900859|7.9936181|56.795135 unknown
InChI: InChI=1S/C7H10N2O/c1-3-6-4-9-7(10-2)5-8-6/h4-5H,3H2,1-2H3
charge 0 multiplicity 1
20 atoms
O  -2.696597 0.450394 0.29779
N  0.886722 1.112269 0.063766
N  -0.934253 -1.046001 -0.252605
C  2.830659 -0.32189 -0.461444
C  1.337584 -0.14809 -0.28083
C  3.609102 -0.112147 0.862719
C  0.413775 -1.206326 -0.436555
C  -1.354084 0.195496 0.088871
C  -0.44233 1.283528 0.245286
C  -3.622732 -0.690446 0.127157
H  3.039734 -1.327981 -0.871026
H  3.185041 0.41704 -1.205187
H  3.385063 0.886172 1.276801
H  4.698351 -0.185108 0.692141
H  3.326595 -0.869932 1.616103
H  0.747841 -2.211489 -0.714809
H  -0.803436 2.280786 0.513456
H  -3.563925 -1.087184 -0.900594
H  -4.61632 -0.267449 0.334117
H  -3.377188 -1.498243 0.837343
