program: Gaussian 09
title: 000106442
version: EM64L-G09RevD.01
frameworkgroup: C1[X(C11H16O)]
method: RPBEPBE
basis: SDD
operation: Freq
keyword: #pfreq=noraman
keyword: PBEPBE/SDD
title: #p freq=noraman PBEPBE/SDD
converged: YES YES NO NO
title: Mulliken charges:
elementType: O C C C C C C C C C C C H H H H H H H H H H H H H H H H
charge: -0.289668 -0.575794 0.066775 -0.230063 0.469636 -0.692707 -0.697720 -0.437341 -0.374271 -0.221786 -0.228510 -0.247121 0.227867 0.199291 0.180501 0.194493 0.190263 0.211422 0.222897 0.223592 0.199475 0.232731 0.220606 0.226848 0.260690 0.221608 0.221608 0.224677
chargesum: 0.00000
title: Mulliken charges with hydrogens summed into heavy atoms:
elementType: O C C C C C C C C C C C
charge: -0.289668 -0.148637 0.247276 0.154694 0.469636 -0.034795 -0.044908 -0.210493 -0.113581 -0.000178 -0.006903 -0.022444
polarizability: 1.44646311e+02 5.03529067e+00 1.26112396e+02 -1.50830325e+01 4.53587289e+00 8.44648556e+01
1716.lowfreq: -12.8595 -8.0030 -0.0005 -0.0002 0.0008 3.7905 19.4684 33.4534 45.7150
frequency: 19.1961 33.0877 45.6201 118.3009 137.1785 180.9479 193.7525 243.4739 251.3227 309.2385 348.6441 389.7908 404.4962 451.0642 465.4590 497.5087 569.5509 617.6915 704.8722 753.4369 756.9586 774.3262 853.5284 859.6481 915.1776 919.0510 924.2012 935.6990 972.6037 975.4032 990.5684 992.9111 1014.4659 1029.5457 1066.3273 1084.7754 1118.8473 1145.2875 1169.8165 1174.2837 1188.0475 1188.4813 1216.1145 1231.7288 1312.0778 1324.7121 1330.0619 1337.3747 1370.2165 1380.5775 1384.5492 1390.6797 1439.4119 1455.8272 1457.9289 1465.7524 1471.2714 1476.9673 1485.6749 1489.0344 1591.8716 1614.2053 2922.0408 2925.6898 2973.4541 2981.3407 2989.9684 2995.4384 3047.6553 3076.0130 3084.8372 3091.4650 3096.9610 3110.5725 3121.7201 3135.3959 3151.7099 3163.8499
redmass: 3.7112 2.8450 3.6590 4.2938 2.8968 2.7357 1.0297 1.7489 1.5891 2.4935 2.3543 2.5668 2.8213 2.9347 2.3063 3.9512 2.8575 6.2205 1.7463 2.4481 3.1006 2.1138 1.2546 2.5304 1.4024 1.2363 2.2370 1.4006 1.9448 1.5753 2.7081 1.7356 3.0162 2.0885 2.4346 1.6174 1.9307 1.9115 1.0858 1.5398 1.1693 1.4091 2.0437 1.1946 1.2193 1.3204 1.3997 1.4422 1.2768 2.3317 2.1113 1.2344 2.1347 1.0513 1.1177 1.0556 1.0513 1.2016 1.8048 1.0810 6.0484 6.1137 1.0685 1.0699 1.0938 1.0369 1.0355 1.0703 1.1012 1.0990 1.1005 1.0994 1.1001 1.0865 1.0867 1.0929 1.0962 1.0997
irintensity: 0.1092 0.5182 0.1168 3.8734 2.7978 3.4193 0.0925 0.3700 2.2320 0.3334 0.5132 1.9219 0.1267 2.2628 3.6451 6.4036 13.9829 0.5241 56.3647 34.3208 4.0033 17.3205 0.2838 5.2201 5.6897 2.3797 10.9781 2.0795 5.4581 1.8830 0.0739 0.7626 54.6343 11.5905 24.4244 13.3959 91.0992 23.0501 1.4187 13.9880 0.9011 4.0479 0.0729 4.6571 41.2382 4.5817 3.7291 3.3329 18.3998 11.2900 6.4523 27.3710 6.6745 8.0397 11.0761 3.3720 6.4123 3.1184 15.9012 19.1189 0.8064 6.8780 38.1842 72.3690 22.5838 28.8921 20.9349 80.0185 21.0556 30.9275 10.8941 61.6609 39.3639 9.7876 1.0668 35.2264 35.8613 11.7858
temp: 298.150 k
press: 1.00000 atm
elementType: 8 6 6 6 6 6 6 6 6 6 6 6 1 1 1 1 1 1 1 1 1 1 1 1 1 1 1 1
symmnumber: 1
zpe: 633295.5 jmol-1
zpe.correction: 0.241210 hartree
zpe.thermalcorrener: 0.253887 hartree
zpe.thermalcorrenthalpy: 0.254832 hartree
zpe.thermalcorrgfe: 0.200359 hartree
zpe.sumelectzpe: -503.058196 hartree
zpe.sumelectthermal: -503.045518 hartree
zpe.sumelectthermalent: -503.044574 hartree
zpe.sumelectthermalfe: -503.099047 hartree
dipole: -1.1857 -0.7001 -1.2040
dipole: 1.8291
quadrupole: -68.7017 -66.9699 -75.2239
quadrupole: 0.2988 -0.5864 0.9548
quadrupole: 1.5968 3.3286 -4.9254 0.2988 -0.5864 0.9548
hfenergy: -503.2994059 hartree
pointgroup: C01 [X(C11H16O1)]
dipole: 0.4917982 -0.2643997 0.4539817 debye
polarizability: 143.3774321|-5.0160708|125.8826915|-17.575625|-4.8309316|85.9634385 unknown
InChI: InChI=1S/C11H16O/c1-10(2)12-9-8-11-6-4-3-5-7-11/h3-7,10H,8-9H2,1-2H3
charge 0 multiplicity 1
28 atoms
O  1.865187 -0.119965 -0.504248
C  -0.041577 -1.613053 -0.75667
C  2.932831 0.441791 0.354336
C  1.2905 -1.378757 -0.014682
C  -1.171286 -0.695001 -0.311534
C  4.204222 -0.431502 0.331585
C  3.181764 1.857921 -0.178925
C  -2.25351 -1.201008 0.453955
C  -1.162443 0.686997 -0.639831
C  -3.300311 -0.353163 0.885153
C  -2.206948 1.536316 -0.211321
C  -3.280369 1.020637 0.55301
H  0.161579 -1.485889 -1.837478
H  -0.335431 -2.669321 -0.603157
H  2.543762 0.497764 1.397408
H  1.984356 -2.222286 -0.220915
H  1.121565 -1.323166 1.084057
H  5.001725 0.037354 0.937296
H  4.017622 -1.439591 0.743496
H  4.571197 -0.540298 -0.705044
H  3.94413 2.375419 0.430908
H  2.248612 2.446309 -0.15345
H  3.536967 1.813965 -1.224131
H  -2.279078 -2.267961 0.71076
H  -0.324788 1.085565 -1.221236
H  -4.129337 -0.764074 1.473062
H  -2.186027 2.600259 -0.475296
H  -4.09181 1.680036 0.88179
