program: Gaussian 09
title: 000106418
version: EM64L-G09RevD.01
frameworkgroup: C1[X(C11H22O2)]
method: RPBEPBE
basis: SDD
operation: Freq
keyword: #pfreq=noraman
keyword: PBEPBE/SDD
title: #p freq=noraman PBEPBE/SDD
converged: NO YES NO NO
title: Mulliken charges:
elementType: O O C C C C C C C C C C C H H H H H H H H H H H H H H H H H H H H H H
charge: -0.267369 -0.240891 0.330810 -0.397891 -0.719678 -0.731061 -0.731500 -0.550748 0.243522 -0.367444 -0.262199 -0.345990 -0.686743 0.204532 0.225426 0.209098 0.210747 0.212831 0.210162 0.215622 0.211061 0.209369 0.211200 0.214471 0.248132 0.254721 0.205825 0.207416 0.220894 0.219964 0.197450 0.196167 0.211801 0.211813 0.218481
chargesum: 0.00000
title: Mulliken charges with hydrogens summed into heavy atoms:
elementType: O O C C C C C C C C C C C
charge: -0.267369 -0.240891 0.330810 0.032067 -0.087002 -0.094216 -0.096459 -0.047896 0.243522 0.045798 0.178659 0.047627 -0.044649
polarizability: 1.63592555e+02 2.60996195e+00 1.15846570e+02 3.45747018e-01 -6.55837365e-01 1.04073750e+02
1716.lowfreq: -22.8059 -17.5109 -12.9784 -7.8240 0.0002 0.0005 0.0009 20.8378 32.4139
frequency: -15.6697 17.9118 31.9314 47.0898 71.7040 73.4910 101.8815 126.4292 179.1464 189.9878 194.4677 229.2370 236.6404 241.8591 253.1766 264.3783 319.4981 336.2051 390.7150 398.3439 411.8687 460.5744 489.8234 566.4053 670.5958 737.6400 740.8375 763.0123 795.0215 854.8339 906.8487 916.9250 920.1743 928.6329 930.2984 935.4441 937.3517 955.0217 1015.7362 1039.8335 1047.1368 1077.9336 1081.6228 1114.5403 1124.0849 1146.3837 1154.5076 1203.7953 1211.1555 1238.8372 1254.2117 1268.8976 1271.2531 1285.6695 1285.6845 1311.1587 1342.9321 1354.3938 1371.3136 1372.5560 1374.9806 1391.9472 1400.1828 1439.2385 1458.4753 1460.9505 1464.6804 1467.4289 1467.8961 1471.7155 1478.4748 1480.5879 1484.0015 1485.3535 1489.7740 1495.2433 1638.4986 2965.6242 2966.1579 2969.7684 2970.8322 2976.9152 2978.6880 2988.9430 2990.5645 3000.3784 3013.0637 3033.7929 3043.3587 3058.9518 3060.0022 3062.2212 3065.3332 3067.6479 3069.1090 3069.8515 3070.6365 3077.4156 3078.1731
redmass: 2.9729 2.8536 4.1735 2.7517 1.8234 2.4046 2.1882 3.3673 2.8068 1.1326 3.2318 2.9547 1.1421 1.1222 1.1354 3.4852 2.1032 2.6399 2.6861 2.1044 2.9490 2.5096 3.3900 3.0404 5.5007 1.0703 2.7289 1.5716 1.1400 4.9269 1.8831 2.1793 1.7731 1.7848 1.1734 4.8822 1.2165 1.4903 1.4848 3.3036 1.5388 3.1614 2.2492 2.2070 2.6171 1.4830 1.5531 2.3106 1.3513 1.7886 2.8131 1.1925 1.2643 1.6178 1.1256 1.3524 1.4220 1.5975 1.2341 1.4496 1.2830 1.2185 1.2165 1.0825 1.0524 1.0723 1.0467 1.0778 1.0623 1.0675 1.0420 1.0648 1.0610 1.0587 1.0889 1.0603 9.7076 1.0347 1.0350 1.0586 1.0407 1.0365 1.0574 1.0626 1.0598 1.0567 1.1003 1.0980 1.1037 1.0992 1.1004 1.0998 1.0981 1.0986 1.0982 1.1044 1.0982 1.1003 1.1033
irintensity: 0.1456 0.1378 0.9680 0.2917 0.6684 0.1561 0.0088 1.3179 5.5271 0.0780 1.2232 4.4290 0.2201 0.2477 0.3651 7.6385 0.0308 0.0599 0.0763 0.3742 11.4388 0.0093 1.0111 3.8759 4.1816 9.0773 2.3164 8.8348 0.6563 7.2266 16.1231 1.9707 0.7724 4.6896 0.8466 61.0019 0.1039 1.7729 1.3605 23.3702 5.7858 35.0262 17.4865 254.4956 2.6187 5.3942 90.8926 15.2245 0.1019 6.0574 47.2822 0.1467 0.2347 96.7561 11.3207 9.6039 0.0634 15.0646 24.5109 13.2033 16.6475 9.1296 13.4667 13.9452 0.6921 4.8901 1.1503 0.9134 3.3594 0.2239 13.1018 5.3104 8.8291 12.6888 19.5915 29.9363 166.8927 39.8929 41.6445 27.5145 19.9997 31.7434 5.5161 20.2476 13.9563 46.8817 6.6575 4.7104 1.9649 0.4327 1.1128 7.7397 7.3483 69.7043 82.9577 2.2702 119.8843 63.0007 119.4962
temp: 298.150 k
press: 1.00000 atm
elementType: 8 8 6 6 6 6 6 6 6 6 6 6 6 1 1 1 1 1 1 1 1 1 1 1 1 1 1 1 1 1 1 1 1 1 1
symmnumber: 1
zpe: 811821.2 jmol-1
zpe.correction: 0.309206 hartree
zpe.thermalcorrener: 0.325659 hartree
zpe.thermalcorrenthalpy: 0.326603 hartree
zpe.thermalcorrgfe: 0.263496 hartree
zpe.sumelectzpe: -581.746223 hartree
zpe.sumelectthermal: -581.729771 hartree
zpe.sumelectthermalent: -581.728827 hartree
zpe.sumelectthermalfe: -581.791934 hartree
dipole: -0.7262 -1.6608 0.1028
dipole: 1.8155
quadrupole: -71.8042 -89.6253 -80.9776
quadrupole: -1.7994 0.3602 0.1519
quadrupole: 8.9982 -8.8229 -0.1753 -1.7994 0.3602 0.1519
hfenergy: -582.0554297 hartree
pointgroup: C01 [X(C11H22O2)]
dipole: 0.2841606 0.6386299 -0.1470062 debye
polarizability: 163.5683809|2.4101137|115.2745114|-1.553347|-2.6404436|104.6699828 unknown
InChI: InChI=1S/C11H22O2/c1-5-6-9-13-10(12)7-8-11(2,3)4/h5-9H2,1-4H3
charge 0 multiplicity 1
35 atoms
O  1.329747 0.176156 0.033183
O  0.223836 -1.796019 0.594145
C  -3.678834 0.264506 -0.028122
C  -2.343509 -0.542621 -0.035891
C  -4.836569 -0.74226 -0.266939
C  -3.691581 1.325326 -1.161885
C  -3.898828 0.963816 1.340791
C  -1.063193 0.28758 0.186385
C  0.180651 -0.580077 0.29441
C  3.737069 0.479011 -0.122254
C  2.634228 -0.540172 0.165148
C  5.146157 -0.150707 -0.011766
C  6.268639 0.878404 -0.266489
H  -2.259151 -1.074879 -1.004704
H  -2.390743 -1.328649 0.742078
H  -5.814183 -0.224801 -0.279413
H  -4.71529 -1.264661 -1.234779
H  -4.865516 -1.508474 0.53061
H  -4.672464 1.835371 -1.206043
H  -2.920963 2.103374 -1.007936
H  -3.510114 0.855289 -2.147328
H  -3.14472 1.750058 1.5312
H  -4.892893 1.448383 1.371875
H  -3.851723 0.233895 2.171246
H  -1.134821 0.863946 1.130907
H  -0.8984 1.031509 -0.612429
H  3.64666 1.321634 0.5900
H  3.592059 0.898529 -1.136372
H  2.645024 -1.38455 -0.549016
H  2.7062 -0.956056 1.187692
H  5.236776 -0.985146 -0.736244
H  5.274243 -0.596208 0.995672
H  6.176776 1.322797 -1.275162
H  6.222919 1.702752 0.469352
H  7.267509 0.411742 -0.19142
