program: Gaussian 09
title: 000106432
version: EM64L-G09RevD.01
frameworkgroup: C1[X(C13H22N4O2)]
method: RPBEPBE
basis: SDD
operation: Freq
keyword: #p
keyword: freq=noraman
keyword: PBEPBE/SDD
title: #p freq=noraman PBEPBE/SDD
converged: YES YES NO NO
title: Mulliken charges:
elementType: O O N N N N C C C C C C C C C C C C C H H H H H H H H H H H H H H H H H H H H H H
charge: -0.224463 -0.287517 -0.106822 -0.397956 -0.572710 0.019591 -0.325988 -0.490526 -0.341370 -0.355522 -0.410310 -0.641165 -0.359194 0.337369 0.207373 -0.319126 -0.335807 -0.231611 -0.236612 0.219010 0.195842 0.213512 0.218637 0.187180 0.212172 0.247865 0.223531 0.229683 0.190359 0.194966 0.234144 0.219886 0.197146 0.203581 0.351637 0.256464 0.255135 0.271310 0.283275 0.229872 0.237156
chargesum: 0.00000
title: Mulliken charges with hydrogens summed into heavy atoms:
elementType: O O N N N N C C C C C C C C C C C C C
charge: -0.224463 -0.287517 -0.106822 -0.046319 -0.046265 0.019591 0.088864 -0.058378 0.057982 0.115874 0.009732 0.007831 0.041533 0.337369 0.207373 -0.062662 -0.052532 -0.001738 0.000545
polarizability: 2.06822296e+02 -2.64000963e+01 1.92471200e+02 3.13954271e+01 2.12682860e+01 1.63475193e+02
1716.lowfreq: -14.4722 -12.4443 -7.1816 -0.0007 -0.0006 -0.0005 4.9848 10.6336 18.0004
frequency: -9.2848 10.4121 16.8724 29.2553 59.6747 75.5814 84.9282 97.4427 113.0199 147.4734 168.1282 191.6031 204.0967 218.3571 265.2369 272.7512 285.0510 290.6429 323.6019 358.2641 361.9107 380.8959 400.6578 423.4675 426.7582 509.2032 520.5429 539.6484 547.5996 609.0378 611.1766 651.3391 658.1723 714.4789 728.2478 746.9820 766.2728 774.8980 790.2841 822.1410 844.1036 848.9978 849.5732 880.1533 953.6482 966.4298 966.7097 985.3360 998.0783 1024.2183 1032.6467 1057.8806 1060.5416 1067.8928 1081.0706 1095.9437 1107.6052 1114.8478 1123.8788 1141.3321 1158.6541 1178.5172 1194.4401 1206.7684 1224.0203 1229.6626 1240.5295 1263.8703 1281.0197 1286.2857 1295.2313 1301.7133 1338.0004 1338.7164 1347.8925 1354.9492 1361.5214 1381.0450 1384.1418 1389.3931 1430.6771 1442.8962 1456.5510 1463.2800 1465.7230 1469.6849 1476.2491 1477.7672 1483.3445 1485.9481 1495.2914 1514.5964 1577.6041 1628.1247 1637.4517 2840.4030 2855.4423 2867.2260 2901.6412 2948.6370 2971.2948 2988.9229 3007.2400 3010.2536 3011.5625 3022.1377 3036.5773 3046.9512 3052.4461 3088.1450 3137.4121 3162.0573 3176.1924 3186.0706 3329.5440 3445.8274 3573.0944
redmass: 3.1882 4.9270 4.8673 4.0820 3.2086 3.0284 4.2161 3.6111 4.0058 4.0154 1.6541 2.0029 2.1480 1.3044 4.6239 3.8488 1.8166 3.2151 3.0417 2.5713 2.6561 4.4552 3.4821 2.7165 3.3687 2.8324 3.0551 5.1785 2.7644 1.3019 5.1313 7.4919 4.9307 2.6121 2.1105 1.4337 1.3314 7.0215 1.4080 2.0849 1.8872 1.8268 1.9780 2.6030 1.8228 1.7595 1.4924 1.3126 1.3692 1.9987 2.7321 2.2127 2.1717 3.1945 2.1566 2.3743 1.9101 2.0188 1.9186 1.6895 1.5047 1.8072 2.1896 1.3553 1.6522 1.3205 1.4922 1.5171 1.3331 1.2220 1.2854 3.2452 1.4669 1.3317 1.3895 1.4649 1.8417 1.8376 1.9551 1.4133 1.1752 3.1558 1.0826 1.1076 1.0905 1.1333 1.0866 1.0822 1.4352 1.3404 1.0839 3.5764 3.9488 6.5663 1.0936 1.0704 1.0618 1.0666 1.0697 1.0588 1.0670 1.0704 1.0935 1.0897 1.0860 1.0892 1.0722 1.0985 1.0980 1.0997 1.0873 1.0899 1.0939 1.0985 1.0783 1.0448 1.0971
irintensity: 1.2466 0.0881 0.7870 0.5040 3.7144 2.5813 0.4874 0.2122 0.4288 1.5325 0.5961 8.9967 8.3217 32.3238 1.0740 2.2689 8.1381 9.5365 8.4552 1.4676 6.5378 6.9454 0.1573 0.1831 0.1936 5.0061 18.5387 2.6255 18.4324 214.8088 13.2760 5.2959 15.9554 7.1893 32.5619 162.2418 22.9544 1.9387 4.1133 0.7591 0.5576 1.1232 2.8788 0.9249 28.9957 3.1247 3.4329 0.1544 2.9429 27.9812 22.1893 17.6718 4.2434 13.2911 3.0209 12.3198 11.0864 6.7343 24.7289 19.1828 100.8993 45.8084 148.5626 17.6013 3.5661 12.1694 25.8975 10.9792 6.6044 1.4286 32.4996 223.6560 31.8104 10.5999 24.1908 3.6632 24.2070 3.6653 3.0984 6.2510 5.2912 8.8052 4.0826 1.3347 9.6631 72.6520 27.9913 18.1303 10.6522 27.5824 7.6086 111.5584 137.3802 162.0924 40.2313 66.2244 59.4394 245.5503 113.2077 40.9750 28.4057 17.3790 39.7059 6.3749 39.6191 29.9697 25.1296 47.4902 84.2680 33.8644 9.0262 11.5676 6.2127 10.9546 45.0142 1.6754 0.0320
temp: 298.150 k
press: 1.00000 atm
elementType: 8 8 7 7 7 7 6 6 6 6 6 6 6 6 6 6 6 6 6 1 1 1 1 1 1 1 1 1 1 1 1 1 1 1 1 1 1 1 1 1 1
symmnumber: 1
zpe: 905080.5 jmol-1
zpe.correction: 0.344727 hartree
zpe.thermalcorrener: 0.364186 hartree
zpe.thermalcorrenthalpy: 0.365131 hartree
zpe.thermalcorrgfe: 0.293888 hartree
zpe.sumelectzpe: -876.455999 hartree
zpe.sumelectthermal: -876.436540 hartree
zpe.sumelectthermalent: -876.435596 hartree
zpe.sumelectthermalfe: -876.506839 hartree
dipole: 3.8378 1.6370 5.1750
dipole: 6.6475
quadrupole: -119.6608 -111.5383 -119.9907
quadrupole: -15.4324 -4.0833 0.9962
quadrupole: -2.5975 5.5249 -2.9274 -15.4324 -4.0833 0.9962
hfenergy: -876.8007263 hartree
pointgroup: C01 [X(C13H22N4O2)]
dipole: -1.3128136 0.5317082 -2.1985934 debye
polarizability: 200.9013978|30.048889|190.1520357|33.2028521|-19.9836429|171.7152551 unknown
InChI: InChI=1S/C13H22N4O2/c1-16(10-4-8-14)11-5-9-15-12-6-2-3-7-13(12)17(18)19/h2-3,6-7,15H,4-5,8-11,14H2,1H3
charge 0 multiplicity 1
41 atoms
O  3.667595 -0.810812 2.493786
O  1.92942 -1.967107 1.579266
N  -2.970238 -0.976352 -0.295413
N  0.776474 -1.094307 -0.605321
N  -3.669008 3.4083 0.205941
N  2.766986 -0.946675 1.574913
C  -2.093024 -2.157876 -0.101235
C  -1.179814 -2.426015 -1.322667
C  -3.411951 -0.37224 0.992123
C  -0.252378 -1.239234 -1.645396
C  -4.01588 1.040839 0.852576
C  -4.099819 -1.25614 -1.205817
C  -3.051499 2.063028 0.218267
C  1.674386 -0.061436 -0.535556
C  2.668113 0.040769 0.515293
C  1.67509 0.985918 -1.521858
C  3.591094 1.121651 0.554138
C  2.589966 2.041236 -1.465097
C  3.560806 2.119851 -0.424556
H  -1.461103 -1.966267 0.786374
H  -2.681632 -3.083985 0.120244
H  -1.794467 -2.63807 -2.217164
H  -0.581125 -3.339429 -1.132605
H  -4.152641 -1.031567 1.515603
H  -2.521318 -0.30747 1.646491
H  -0.876908 -0.324222 -1.69313
H  0.227112 -1.386133 -2.636041
H  -4.29201 1.405048 1.860493
H  -4.959256 1.007169 0.269031
H  -4.831175 -1.986564 -0.774903
H  -4.643469 -0.32474 -1.437355
H  -3.730115 -1.667349 -2.160889
H  -2.741385 1.688775 -0.785701
H  -2.132978 2.114081 0.834814
H  0.874392 -1.799591 0.143717
H  0.942024 0.94566 -2.331264
H  -4.539484 3.455215 -0.335139
H  -3.026142 4.164528 -0.049662
H  4.315578 1.139241 1.372576
H  2.557678 2.818443 -2.237076
H  4.273105 2.949131 -0.390603
