program: Gaussian 09
title: 000106406
version: EM64L-G09RevD.01
frameworkgroup: C1[X(C13H17ClN3)]
method: RPBEPBE
basis: SDD
operation: Freq
keyword: #p
keyword: freq=noraman
keyword: PBEPBE/SDD
title: #p freq=noraman PBEPBE/SDD
converged: NO YES NO NO
title: Mulliken charges:
elementType: Cl N N N C C C C C C C C C C C C C H H H H H H H H H H H H H H H H H
charge: 0.080177 -0.137392 -0.026584 0.117585 -0.058534 -0.403628 -0.407424 -0.393511 -0.401368 -0.398222 0.437871 -0.661340 -0.244392 -0.309322 -0.398742 -0.358218 0.554464 0.202311 0.208798 0.222580 0.224233 0.198976 0.231226 0.202860 0.206082 0.232640 0.231037 0.206202 0.257615 0.264962 0.266676 0.283523 0.284408 0.284451
chargesum: 1.00000
title: Mulliken charges with hydrogens summed into heavy atoms:
elementType: Cl N N N C C C C C C C C C C C C C
charge: 0.080177 -0.137392 -0.026584 0.117585 0.143778 0.027750 0.015785 0.040575 0.037354 0.039016 0.437871 0.127913 0.039131 -0.024914 -0.398742 -0.073767 0.554464
polarizability: 3.38292693e+02 1.91594426e+01 1.64117379e+02 -2.21593462e+00 -1.10536553e+00 9.94725221e+01
1716.lowfreq: -26.2843 -8.4833 -0.0004 0.0016 0.0017 5.5753 18.5709 41.2952 63.6735
frequency: -21.6602 39.1275 63.1861 85.8035 130.0716 134.3514 146.3458 180.4420 206.0233 219.1078 226.8079 244.6258 291.1859 334.0799 339.8055 364.1028 381.2633 406.5681 429.1200 460.5106 477.8941 478.5967 495.9044 570.6885 586.6001 596.1019 677.4577 694.3284 713.4608 778.8665 783.6600 804.0053 819.7929 846.6995 849.5100 884.6557 894.5778 918.7270 933.4644 967.5173 987.5736 1008.7499 1046.7181 1058.3826 1073.3562 1074.8281 1100.8559 1113.3065 1148.7810 1151.7742 1189.9387 1194.0617 1243.8976 1245.9971 1254.8753 1261.2559 1273.8440 1302.8442 1318.1965 1323.6590 1336.1455 1343.7951 1346.9739 1351.8822 1378.9578 1391.9817 1435.9938 1458.2072 1463.6154 1465.0171 1469.3837 1473.2976 1475.7696 1481.0805 1489.3545 1511.0822 1524.3460 1619.9755 2065.7863 2975.6224 2977.9764 2980.1320 2984.4117 2987.4589 2998.2478 3029.3316 3041.2915 3052.0926 3052.5714 3055.5848 3065.1491 3086.5569 3147.2884 3169.7144 3197.7683 3200.5966
redmass: 3.1735 7.2363 4.0325 4.1052 2.2390 7.5506 4.0344 1.6618 3.5920 2.1807 5.2238 3.5881 3.2863 2.3472 2.8341 8.3871 3.8022 3.3172 3.1321 3.9787 6.4081 3.0286 1.9870 4.5472 4.5600 5.7702 6.7851 3.1200 4.1814 2.6277 1.4472 1.4514 4.7998 1.9492 1.6941 1.9552 1.4960 1.9860 2.7006 1.3136 2.3914 3.7500 1.9308 1.3293 1.5177 2.1687 1.4161 2.2026 2.4511 1.8802 1.4704 1.6544 1.4055 1.6844 1.9210 1.3075 1.4595 1.2560 1.3103 1.3507 1.3536 1.4933 2.1662 1.5808 1.5564 1.7983 1.1884 1.0919 1.0998 1.0933 1.0842 1.3795 2.5450 1.1341 1.0919 6.9930 3.0540 6.6970 13.8992 1.0672 1.0609 1.0657 1.0611 1.0591 1.0394 1.0900 1.0970 1.0971 1.0963 1.1006 1.1020 1.1010 1.0967 1.0912 1.0916 1.0952
irintensity: 0.2033 0.1212 0.1441 0.0277 1.1590 0.2592 0.4104 0.5262 0.1256 0.2862 1.0637 0.2060 0.6874 0.1776 0.9755 3.5091 6.1386 4.4840 0.3385 0.0840 4.3809 3.1557 3.1720 2.6502 1.2259 8.0431 9.9438 4.3099 1.1052 5.3664 0.5167 39.0051 6.0146 11.9812 15.4514 8.3341 14.5668 0.5132 1.4649 0.2643 52.0529 53.0865 2.5411 4.2598 3.5339 20.1786 3.4543 1.1583 29.0484 1.5004 1.2599 14.0656 0.5932 21.2901 46.4106 2.3015 11.2526 1.0509 7.4707 13.1765 0.9728 0.4763 2.1002 16.5082 8.7786 33.4374 15.5680 6.1358 23.7380 7.8868 17.6977 29.5311 24.0554 3.5095 23.8411 4.2600 88.4787 553.8006 830.3839 18.3557 25.0375 10.4564 36.4557 17.5549 21.3937 13.6038 31.4104 16.9171 25.9330 10.3893 79.0594 8.7360 5.9169 1.7033 0.9130 0.0570
temp: 298.150 k
press: 1.00000 atm
elementType: 17 7 7 7 6 6 6 6 6 6 6 6 6 6 6 6 6 1 1 1 1 1 1 1 1 1 1 1 1 1 1 1 1 1
symmnumber: 1
zpe: 735179.3 jmol-1
zpe.correction: 0.280015 hartree
zpe.thermalcorrener: 0.295450 hartree
zpe.thermalcorrenthalpy: 0.296394 hartree
zpe.thermalcorrgfe: 0.237309 hartree
zpe.sumelectzpe: -1128.354923 hartree
zpe.sumelectthermal: -1128.339488 hartree
zpe.sumelectthermalent: -1128.338544 hartree
zpe.sumelectthermalfe: -1128.397629 hartree
dipole: -1.5762 4.2494 -0.2235
dipole: 4.5378
quadrupole: -56.3074 -85.7994 -105.2835
quadrupole: -4.9846 -0.1554 -1.0558
quadrupole: 26.1560 -3.3360 -22.8200 -4.9846 -0.1554 -1.0558
hfenergy: -1128.6349378 hartree
pointgroup: C01 [X(C13H17Cl1N3)]
dipole: -0.68702 -1.6312471 0.2331037 debye
polarizability: 335.1687869|-23.1621847|164.2252405|21.3925421|-10.4275794|102.4885667 unknown
InChI: InChI=1S/C13H17ClN3/c1-17(10-5-3-2-4-6-10)11-7-8-13(16-15)12(14)9-11/h7-10H,2-6H2,1H3
charge 1 multiplicity 1
34 atoms
Cl -2.708586 2.562457 -0.669869
N  0.962522 -1.060552 0.181124
N  -4.464213 0.104275 -0.440032
N  -5.602129 0.337914 -0.571723
C  2.058348 -0.050536 -0.038757
C  2.547888 0.543698 1.309933
C  3.235522 -0.61621 -0.875432
C  3.607618 1.644696 1.058088
C  4.274333 0.506949 -1.128823
C  4.78079 1.121554 0.197347
C  -0.361484 -0.760894 0.028664
C  1.368903 -2.410896 0.644901
C  -0.818105 0.592562 -0.225034
C  -1.372815 -1.800313 0.12789
C  -2.162225 0.875031 -0.37733
C  -2.718162 -1.52255 -0.027486
C  -3.148916 -0.173323 -0.286233
H  1.628282 0.766643 -0.645074
H  2.993512 -0.261023 1.928597
H  1.690824 0.954891 1.877674
H  2.859565 -1.019637 -1.834797
H  3.741601 -1.442689 -0.340445
H  3.978999 2.019995 2.029089
H  3.130989 2.506435 0.547275
H  3.821303 1.299726 -1.758267
H  5.119097 0.090053 -1.706811
H  5.487971 1.94366 -0.015042
H  5.345482 0.355925 0.766917
H  0.751962 -2.733105 1.500212
H  2.413588 -2.377183 0.979609
H  1.291458 -3.157366 -0.166529
H  -0.115256 1.425081 -0.270638
H  -1.079751 -2.836645 0.302016
H  -3.463118 -2.321324 0.034783
