program: Gaussian 09
title: 000106316
version: EM64L-G09RevD.01
frameworkgroup: C1[X(C7H15N)]
method: RPBEPBE
basis: SDD
operation: Freq
keyword: #pfreq=noraman
keyword: PBEPBE/SDD
title: #p freq=noraman PBEPBE/SDD
converged: YES YES NO NO
title: Mulliken charges:
elementType: N C C C C C C C H H H H H H H H H H H H H H H
charge: -0.092112 -0.112569 -0.535962 -0.482498 -0.320622 -0.625123 -0.356852 -0.693137 0.226248 0.230792 0.236954 0.237470 0.228976 0.167688 0.193785 0.233749 0.187043 0.218722 0.204758 0.220247 0.207026 0.206767 0.218653
chargesum: 0.00000
title: Mulliken charges with hydrogens summed into heavy atoms:
elementType: N C C C C C C C
charge: -0.092112 0.113679 -0.068217 -0.016052 0.040850 0.014390 0.068152 -0.060691
polarizability: 9.35033008e+01 -5.73351620e-01 8.34445855e+01 -3.97183556e-01 2.84474137e-01 6.78207555e+01
1716.lowfreq: -18.7102 -8.8816 -0.0004 -0.0004 0.0004 16.2716 78.4972 82.3208 113.9057
frequency: 78.4217 82.2372 113.8957 166.8741 216.3378 225.3404 229.7891 276.0732 335.5446 362.0705 449.6873 523.9090 713.4027 757.9538 786.8244 818.7628 869.5507 891.3108 914.6681 935.8642 1005.5010 1037.1998 1054.2633 1060.5353 1066.2265 1099.0517 1102.6119 1117.8669 1137.3052 1164.8070 1188.4080 1200.8636 1236.6455 1259.8660 1297.6075 1312.0460 1352.1235 1376.8715 1390.2909 1424.0829 1429.8126 1457.9967 1464.2591 1471.4548 1477.1998 1478.3620 1483.6187 1490.9503 2826.9741 2864.5527 2957.4288 2972.0418 2994.4066 3000.6688 3022.6891 3044.5698 3073.5355 3074.7859 3085.5849 3096.0770 3106.0053 3199.3653 3217.1274
redmass: 1.5868 2.3305 3.0861 2.4628 1.2894 1.2010 1.9840 1.8953 2.8461 2.7561 2.6865 2.7560 2.2108 1.1000 1.1251 1.4068 1.4644 1.6018 2.6270 3.2172 2.3020 1.2445 1.8678 1.7009 1.6929 1.2021 1.4542 1.5383 1.8859 1.3717 2.7385 2.1181 1.5292 1.4637 1.1877 1.4735 1.5358 1.4409 1.2309 1.0994 1.1548 1.3149 1.0664 1.0924 1.0530 1.0436 1.0732 1.1027 1.0706 1.0569 1.0855 1.0357 1.0616 1.0854 1.0734 1.1002 1.1009 1.1000 1.1000 1.0510 1.0628 1.1168 1.1151
irintensity: 0.1430 0.1272 0.1221 1.2223 0.3074 0.0314 1.4951 2.9753 1.3710 2.5125 3.6091 1.1425 9.9487 4.8773 1.4837 15.5644 16.9910 9.7757 11.8320 2.2774 6.3417 38.8132 2.9783 0.9609 37.2516 0.6222 1.7237 6.2923 3.4655 0.1739 15.3086 3.0901 0.4220 5.1868 5.9143 2.8105 27.1033 3.3459 14.5458 4.7575 8.3562 10.8728 14.0196 8.7363 2.8935 10.5536 7.0111 17.7921 85.3897 145.1624 81.2935 42.6716 20.1821 35.0268 45.4671 1.4036 71.7954 61.3382 37.1427 26.2169 9.7688 0.7384 28.4516
temp: 298.150 k
press: 1.00000 atm
elementType: 7 6 6 6 6 6 6 6 1 1 1 1 1 1 1 1 1 1 1 1 1 1 1
symmnumber: 1
zpe: 543835.3 jmol-1
zpe.correction: 0.207136 hartree
zpe.thermalcorrener: 0.217057 hartree
zpe.thermalcorrenthalpy: 0.218001 hartree
zpe.thermalcorrgfe: 0.172348 hartree
zpe.sumelectzpe: -329.765274 hartree
zpe.sumelectthermal: -329.755353 hartree
zpe.sumelectthermalent: -329.754409 hartree
zpe.sumelectthermalfe: -329.800062 hartree
dipole: -0.0995 0.2942 0.7618
dipole: 0.8227
quadrupole: -51.4201 -50.5504 -51.9292
quadrupole: 0.3432 1.1045 -0.7899
quadrupole: -0.1202 0.7495 -0.6293 0.3432 1.1045 -0.7899
hfenergy: -329.97241 hartree
pointgroup: C01 [X(C7H15N1)]
dipole: -0.0485266 0.1046944 0.3024057 debye
dipolederiv: -0.606198 -0.0260098 0.0121327 -0.0036003 -0.5674014 -0.0702575 0.0128313 0.0078456 -0.5460126 0.2112697 -0.1102415 0.1081537 -0.1388154 0.2955162 -0.0956314 0.1948413 -0.1518372 0.3779294 -0.2522478 -0.011015 0.0867279 -0.0613193 0.0117346 -0.0202874 0.0748081 -0.0104224 0.0733967 0.0184307 -0.0617941 -0.0077423 -0.0560702 -0.1978092 -0.1131162 -0.01662 -0.0923301 0.0456592 0.548054 -0.0066555 -0.0893624 0.0495922 0.0914506 0.0061706 -0.0946422 0.035804 0.4246442 0.0560466 0.1256737 0.0129612 0.1320925 0.4251121 0.1004893 -0.0204756 0.0960498 0.3378273 -0.0052295 -0.0430752 0.0012216 -0.0508524 0.051721 -0.013529 0.0462638 -0.0322928 0.1132467 -0.0532152 -0.0179967 0.0185313 -0.0523421 0.0653799 -0.0120472 -0.0014566 -0.0163134 0.0971172 0.016197 0.0776598 0.048385 0.0978029 -0.0266519 -0.0360064 -0.0490547 0.0618446 -0.2476447 -0.095667 0.012867 -0.07049 0.0205638 0.0943189 0.0350727 -0.1117022 0.0378792 0.009038 0.0455412 -0.0271099 0.0127142 -0.0656031 0.0690847 0.0924132 0.0566986 0.0824172 -0.0300898 0.0785205 -0.0639109 -0.0916801 -0.0409595 0.0562602 0.0035935 -0.0944934 -0.0368837 -0.03864 0.0984238 -0.014619 -0.0166079 -0.0152191 -0.0971367 0.0725708 -0.0255004 0.1095235 0.0134639 -0.0720514 -0.0181934 0.0065312 -0.0188292 0.0241735 -0.0406132 0.1621874 -0.0726289 -0.2669736 -0.0325887 0.0889063 -0.0275455 0.1045891 -0.103541 0.0665476 -0.0502666 0.0955573 0.0139411 -0.165507 -0.07349 0.0654021 -0.009532 0.0979299 -0.0181944 0.0646036 -0.0164919 0.0669863 0.0638846 -0.013626 0.0392719 -0.0554116 -0.0884005 -0.0510424 -0.0247837 -0.2275231 -0.2344334 0.0400256 0.1343786 -0.0920369 0.0693159 -0.0815419 0.0708557 -0.0805387 0.0961023 -0.0023475 0.0432951 0.0062814 0.0673459 -0.0076794 0.0540384 -0.0357782 0.0421674 -0.0584135 -0.1576423 0.0323372 0.0830419 -0.0388871 0.0827732 -0.0904117 0.0617712 -0.0671199 0.084104 0.023394 0.0566492 0.0038554 0.013551 0.0326457 0.0875409 -0.0433385 0.0852197 -0.0283671 -0.1754855 0.0043476 0.0608712 -0.0302896 0.1371948 -0.0721406 0.1046862 -0.0588686 0.1033792 0.0251576 -0.0303182 -0.1057982 -0.0282876 -0.1503366 -0.0992261 -0.0643289 -0.0440986 -0.0670026 0.0774678 unknown
polarizability: 93.5389857|-0.1889205|83.3831756|0.0101961|0.7561369|67.8464805 unknown
InChI: InChI=1S/C7H15N/c1-3-6-8(2)7-4-5-7/h7H,3-6H2,1-2H3
charge 0 multiplicity 1
23 atoms
N  0.36314 0.749611 -0.160854
C  1.160699 -0.254142 0.532962
C  2.524734 -0.627372 -0.058188
C  1.366171 -1.634728 -0.105223
C  -1.083677 0.703422 0.181667
C  0.917048 2.112302 0.019008
C  -1.800519 -0.585836 -0.266138
C  -3.314724 -0.52524 0.030321
H  1.104493 -0.237543 1.640249
H  3.35627 -0.813017 0.627854
H  2.79994 -0.14883 -1.002539
H  0.895269 -1.797739 -1.077768
H  1.403772 -2.51041 0.550048
H  -1.24385 0.843766 1.284289
H  -1.566352 1.566617 -0.318614
H  1.978237 2.122864 -0.282301
H  0.856858 2.479818 1.07446
H  0.365874 2.824609 -0.621321
H  -1.628654 -0.726459 -1.350584
H  -1.356587 -1.459598 0.245206
H  -3.505345 -0.390164 1.112148
H  -3.794085 0.318013 -0.502509
H  -3.821211 -1.454842 -0.286871
