program: Gaussian 09
title: 000106350
version: EM64L-G09RevD.01
frameworkgroup: C1[X(C13H9ClN2O6S)]
method: RPBEPBE
basis: SDD
operation: Freq
keyword: #p
keyword: freq=noraman
keyword: PBEPBE/SDD
title: #p freq=noraman PBEPBE/SDD
converged: YES YES NO NO
title: Mulliken charges:
elementType: Cl S O O O O O O N N C C C C C C C C C C C C C H H H H H H H H H
charge: 0.065459 1.001118 -0.507947 -0.494060 -0.427728 -0.311816 -0.185995 -0.161077 -0.771778 0.008486 -0.011874 0.420995 -0.342152 -0.236101 0.085195 0.543129 -0.315925 -0.166246 -0.327456 -0.297505 -0.218351 -0.246555 0.167431 0.422222 0.324590 0.299911 0.251587 0.278920 0.278065 0.241436 0.240875 0.393148
chargesum: 0.00000
title: Mulliken charges with hydrogens summed into heavy atoms:
elementType: Cl S O O O O O O N N C C C C C C C C C C C C C
charge: 0.065459 1.001118 -0.507947 -0.494060 -0.034580 -0.311816 -0.185995 -0.161077 -0.349557 0.008486 -0.011874 0.420995 -0.017562 0.063810 0.085195 0.543129 -0.064338 0.112674 -0.327456 -0.019439 0.023085 -0.005680 0.167431
polarizability: 2.80121331e+02 -5.50949411e+00 2.31305328e+02 -8.57223409e+00 1.72626472e+01 1.63190954e+02
1716.lowfreq: -6.0003 0.0012 0.0013 0.0017 3.0710 5.2539 11.9988 14.5548 26.8053
frequency: 11.9751 14.4501 26.7581 44.0061 61.1398 96.1679 99.6679 107.8431 116.0750 144.9900 155.3513 182.3641 191.4593 210.8380 216.2811 246.1904 262.7942 267.4570 293.3364 338.2600 370.8847 390.0214 396.2525 411.9481 417.6905 424.9410 477.6446 502.6794 520.0712 524.6987 573.6736 579.8577 586.8939 604.4467 643.6107 677.0780 679.7674 683.0796 707.1837 733.5517 737.6578 752.8559 765.8166 790.0262 800.5320 820.3037 834.4157 854.6698 869.5908 925.8177 956.0920 970.0223 971.9070 995.3857 1017.3198 1020.6145 1044.2247 1067.6695 1108.0301 1110.8185 1148.3791 1166.2254 1177.1785 1202.8740 1219.3553 1242.1011 1308.5048 1312.9263 1361.3905 1375.8245 1382.4591 1389.3844 1396.6463 1437.0844 1440.5368 1475.5631 1570.0826 1570.8766 1581.9327 1588.4606 1625.0786 3143.4874 3161.5738 3161.8722 3162.4631 3169.2980 3177.9004 3181.3821 3184.8019 3533.6316
redmass: 8.2315 8.4685 8.3185 15.5816 9.5522 9.0953 10.0354 6.7473 6.6735 5.5260 8.0378 12.8959 11.7644 15.8729 11.4231 6.5453 8.1606 8.6457 7.7295 10.8549 8.9189 10.3600 9.8561 4.1564 6.0278 4.0480 7.1410 6.4605 3.2901 6.2213 5.8815 1.2009 6.2536 6.3340 7.8490 5.6748 5.0377 3.9971 8.8167 5.1262 4.6994 2.2624 1.3758 1.8398 6.6177 8.2440 1.3440 5.2648 1.5079 1.4861 9.2989 1.3754 1.4239 1.3523 7.1021 5.8617 2.1920 2.2267 2.1398 2.6384 1.3679 1.6671 1.1608 12.3277 1.3630 1.3222 1.5821 2.5759 3.8060 2.6959 9.9884 6.8064 7.1220 2.6036 2.5332 2.5131 7.2555 5.2537 5.7816 8.2439 6.1844 1.0873 1.0879 1.0900 1.0848 1.0921 1.0940 1.0972 1.0990 1.0642
irintensity: 0.4439 0.9516 0.9116 0.3227 1.8007 0.4330 3.1698 0.6084 1.9477 1.8718 3.3479 1.2218 0.8700 3.1597 2.7452 2.1698 0.9852 6.1281 9.5832 4.0987 32.2724 35.2779 7.5417 33.9790 121.1211 8.3915 11.8877 6.5920 2.5358 75.2779 14.0942 117.2255 8.7924 102.0578 14.0927 1.7306 10.6348 38.3090 19.6201 2.3415 35.3470 7.2564 156.4860 32.2742 66.2841 124.6278 20.3983 63.9229 3.3204 14.7987 56.6404 2.6074 1.9530 0.7667 194.1309 169.8992 36.8791 21.7731 105.6117 26.4362 10.2337 108.1351 10.3171 202.6493 16.1750 11.2179 6.6149 295.3527 11.5588 88.7693 29.6976 2.6968 56.7637 54.5729 77.6336 203.1309 26.2297 55.3738 82.1470 8.9101 226.0917 6.7951 103.3887 19.1602 298.8952 13.9220 4.2518 1.4624 9.0501 83.2403
temp: 298.150 k
press: 1.00000 atm
elementType: 17 16 8 8 8 8 8 8 7 7 6 6 6 6 6 6 6 6 6 6 6 6 6 1 1 1 1 1 1 1 1 1
symmnumber: 1
zpe: 539853.3 jmol-1
zpe.correction: 0.205619 hartree
zpe.thermalcorrener: 0.226885 hartree
zpe.thermalcorrenthalpy: 0.227829 hartree
zpe.thermalcorrgfe: 0.151792 hartree
zpe.sumelectzpe: -1917.851907 hartree
zpe.sumelectthermal: -1917.830641 hartree
zpe.sumelectthermalent: -1917.829697 hartree
zpe.sumelectthermalfe: -1917.905734 hartree
dipole: 2.4279 -0.0041 -5.1232
dipole: 5.6693
quadrupole: -146.5577 -149.8397 -152.0520
quadrupole: 17.4026 -5.3103 9.7812
quadrupole: 2.9254 -0.3565 -2.5689 17.4026 -5.3103 9.7812
hfenergy: -1918.0575259 hartree
pointgroup: C01 [X(C13H9Cl1N2O6S1)]
dipole: -0.3004898 0.6915756 2.0991666 debye
polarizability: 264.4369856|-13.8297166|216.4965487|-38.9526718|-28.9545768|193.6840793 unknown
InChI: InChI=1S/C13H9ClN2O6S/c14-10-6-5-8(7-12(10)16(19)20)23(21,22)15-11-4-2-1-3-9(11)13(17)18/h1-7,15,17H
charge 0 multiplicity 1
32 atoms
Cl 5.373704 -0.448768 0.527673
S  -0.776825 -1.901137 -0.905241
O  -1.023365 -3.414935 -0.381619
O  -1.056774 -1.433437 -2.435245
O  -4.142578 0.847317 3.265476
O  -3.16845 -1.079819 2.445636
O  2.94462 1.544734 -2.615337
O  4.972055 0.575751 -2.211885
N  -1.707498 -0.913241 0.294925
N  3.706661 0.686066 -2.023354
C  1.02509 -1.449848 -0.519073
C  -2.028163 0.444421 0.205834
C  1.688194 -0.559636 -1.363973
C  1.635303 -2.067718 0.585916
C  -2.84806 1.022685 1.246517
C  3.040199 -0.256615 -1.080929
C  -1.56796 1.288222 -0.845448
C  2.976897 -1.742882 0.865815
C  3.685128 -0.83806 0.040325
C  -3.152701 2.411884 1.211771
C  -1.886126 2.65683 -0.849101
C  -2.674186 3.232903 0.180323
C  -3.367691 0.17256 2.325017
H  -2.180748 -1.472992 1.042523
H  1.203363 -0.118065 -2.24001
H  1.085733 -2.787971 1.199922
H  -1.007452 0.862061 -1.680856
H  3.485035 -2.186538 1.72626
H  -3.773498 2.819989 2.014158
H  -1.52101 3.281115 -1.671853
H  -2.91425 4.299842 0.163538
H  -4.460046 0.196182 3.946996
