program: Gaussian 09
title: 000106337
version: EM64L-G09RevD.01
frameworkgroup: C1[X(C18H31N)]
method: RPBEPBE
basis: SDD
operation: Freq
keyword: #pfreq=noraman
keyword: PBEPBE/SDD
title: #p freq=noraman PBEPBE/SDD
converged: YES YES NO NO
title: Mulliken charges:
elementType: N C C C C C C C C C C C C C C C C C C H H H H H H H H H H H H H H H H H H H H H H H H H H H H H H H
charge: -0.020657 -0.381683 -0.373488 -0.364497 -0.372573 -0.380609 -0.464787 -0.378486 -0.338176 -0.430716 -0.476378 -0.176760 -0.345316 -0.180433 -0.536417 -0.166914 -0.172056 -0.698295 -0.158143 0.198480 0.197657 0.190325 0.195951 0.196098 0.195325 0.208073 0.196941 0.222600 0.221688 0.196526 0.204291 0.199158 0.189058 0.179940 0.213425 0.199949 0.204590 0.248047 0.247690 0.222774 0.191670 0.191691 0.222351 0.202948 0.207005 0.218860 0.221096 0.206941 0.209613 0.215624
chargesum: 0.00000
title: Mulliken charges with hydrogens summed into heavy atoms:
elementType: N C C C C C C C C C C C C C C C C C C
charge: -0.020657 0.014454 0.012788 0.026925 0.032441 0.063680 -0.063970 0.009730 0.055190 0.065020 -0.071838 0.046013 0.038045 0.041918 -0.126464 0.051945 0.049041 -0.066117 -0.158143
polarizability: 2.45477527e+02 -8.48478341e+00 2.04194336e+02 4.93215614e+00 -8.55735342e+00 1.56466687e+02
1716.lowfreq: -7.4979 -4.0345 -0.0002 0.0004 0.0008 6.5015 11.3888 17.1433 25.3491
frequency: 10.6127 17.0279 24.8858 29.6951 31.2368 45.2497 60.8458 69.6678 76.8541 85.4770 97.0068 106.2322 128.6795 134.9721 140.4650 152.4323 156.1922 174.2530 201.2020 220.8919 235.5954 249.6050 264.5703 315.5657 350.5316 368.8242 371.7437 386.4615 420.2186 453.4284 469.0986 499.7539 526.3704 547.8048 721.9765 725.0462 728.3618 751.3823 764.9533 787.4248 810.7955 811.9719 842.4223 883.1023 885.5281 913.2659 918.1409 921.6873 956.8648 969.0235 974.2174 979.7733 990.1150 994.5883 1000.6957 1022.9904 1035.7375 1045.3619 1064.8047 1065.2442 1073.3931 1079.5542 1080.8464 1088.1843 1101.8519 1113.0642 1118.4723 1159.2960 1177.4810 1198.9804 1207.6235 1208.5310 1210.8469 1241.7395 1247.2090 1254.4848 1266.0704 1273.4013 1276.0878 1278.7451 1281.5366 1287.5784 1289.5391 1291.9442 1293.9091 1294.6723 1300.6040 1308.3967 1322.9823 1332.5481 1335.5787 1340.3836 1350.8213 1355.8382 1357.7043 1386.8465 1446.6279 1455.7720 1457.1704 1458.3738 1460.4575 1462.4545 1463.2704 1467.1144 1469.2394 1476.3476 1477.3047 1478.7963 1485.5840 1487.9624 1679.2301 1686.8627 2196.7413 2951.1543 2952.4634 2953.5384 2954.0102 2957.6753 2957.9961 2959.3130 2963.2601 2966.2945 2966.6233 2968.8348 2985.0959 2986.9506 2995.6733 2996.2700 2996.8755 3008.6561 3009.4725 3022.1420 3023.9849 3033.7926 3035.2225 3036.5544 3041.9496 3061.3531 3062.4384 3065.1445 3065.6132 3069.0656 3073.1348 3081.8670
redmass: 4.8694 4.1309 2.2446 3.9191 3.6313 3.7721 2.2782 1.9008 2.9186 2.2167 2.5505 2.6244 2.6878 2.1667 2.4474 2.1092 2.7127 2.3123 3.2769 3.2353 1.1436 2.8917 2.7442 3.0096 3.6993 2.7170 3.5200 2.7687 2.9338 3.0075 2.9033 2.2950 3.2918 3.8813 1.0621 1.0910 1.0940 1.1802 1.2568 1.4813 1.5097 1.4207 1.9228 1.6072 1.4909 1.5577 3.6593 2.2306 1.6165 1.6713 1.2420 1.2126 2.4882 1.8439 3.6768 1.8697 2.9875 2.2251 2.7667 1.9847 2.7645 2.1617 3.1741 2.1710 1.9911 1.8672 1.3754 2.2008 1.5445 1.3558 1.2873 1.3608 1.4164 1.2921 1.2923 1.2859 1.2749 1.1953 1.2406 1.2092 1.1121 1.1120 1.2184 1.1589 1.1760 1.1109 1.2162 1.3018 1.3582 1.3739 1.4402 1.4657 1.5464 1.6404 1.6006 1.2180 1.0826 1.0932 1.0824 1.0931 1.0736 1.0704 1.0803 1.0709 1.0912 1.0457 1.0702 1.0951 1.0991 1.0864 6.3976 6.6655 12.4300 1.0591 1.0588 1.0603 1.0598 1.0593 1.0628 1.0597 1.0614 1.0569 1.0390 1.0605 1.0590 1.0969 1.0589 1.0961 1.0988 1.1002 1.1008 1.0998 1.1029 1.0960 1.1016 1.1030 1.1039 1.0988 1.0948 1.0953 1.1031 1.0996 1.0876 1.0893
irintensity: 0.4583 0.6437 4.3036 0.1454 0.6917 1.1833 0.5734 0.3767 1.8120 1.4071 0.8929 0.1590 0.9231 0.5298 0.4589 0.8071 0.1308 0.1909 0.0800 1.2537 0.0853 2.0995 2.0124 1.1330 2.4978 0.3272 0.4625 0.6928 0.7463 0.6023 0.9541 3.7405 3.1606 2.6571 12.5390 11.0699 0.0550 2.2925 0.2145 0.1946 5.2900 0.2905 2.2904 0.0152 2.8544 6.7185 3.4573 0.7238 10.0062 11.0811 26.9089 66.4922 5.2602 6.2146 0.7682 5.1665 2.3360 7.7021 1.9292 7.9772 4.4808 0.1523 1.2321 0.5712 6.1256 0.4149 0.3551 2.8049 2.1385 0.5664 15.0525 3.5779 0.8784 0.5314 0.4804 0.1327 0.1168 0.2656 1.4368 0.3132 0.1035 0.3832 0.8830 1.0719 0.4534 0.6332 0.7327 3.8794 0.2516 0.4427 1.9627 0.4946 0.9970 0.2450 2.1495 10.4253 6.7384 14.6918 0.5250 13.4279 0.1840 0.9919 1.0826 1.0187 2.7056 10.2488 4.5964 0.6958 10.7652 28.7379 0.1061 0.8605 16.5662 0.1930 1.1061 21.0930 7.7119 18.0199 42.3388 8.1159 28.6373 190.8406 15.6870 97.3436 0.2017 0.9486 44.1875 3.5499 3.7566 3.5851 12.2036 21.7644 3.0254 13.6659 2.7785 53.0636 112.8968 67.3185 46.7572 6.1289 98.7183 55.5297 15.8635 100.4559
temp: 298.150 k
press: 1.00000 atm
elementType: 7 6 6 6 6 6 6 6 6 6 6 6 6 6 6 6 6 6 6 1 1 1 1 1 1 1 1 1 1 1 1 1 1 1 1 1 1 1 1 1 1 1 1 1 1 1 1 1 1 1
symmnumber: 1
zpe: 1166881.8 jmol-1
zpe.correction: 0.444442 hartree
zpe.thermalcorrener: 0.468929 hartree
zpe.thermalcorrenthalpy: 0.469873 hartree
zpe.thermalcorrgfe: 0.384356 hartree
zpe.sumelectzpe: -757.692639 hartree
zpe.sumelectthermal: -757.668152 hartree
zpe.sumelectthermalent: -757.667208 hartree
zpe.sumelectthermalfe: -757.752725 hartree
dipole: 2.9056 -2.7874 0.8471
dipole: 4.1146
quadrupole: -164.1235 -126.5746 -115.4307
quadrupole: 28.6550 -6.2683 1.6809
quadrupole: -28.7472 8.8016 19.9456 28.6550 -6.2683 1.6809
hfenergy: -758.1370806 hartree
pointgroup: C01 [X(C18H31N1)]
dipole: 1.0815749 1.1596956 -0.3253307 debye
polarizability: 244.445984|10.839561|205.2820086|-3.7494845|-8.762|156.4105575 unknown
InChI: InChI=1S/C18H31N/c1-2-3-4-5-6-7-8-9-10-11-12-13-14-15-16-17-18-19/h6-7,9-10H,2-5,8,11-17H2,1H3
charge 0 multiplicity 1
50 atoms
N  -7.958467 -2.459104 0.25478
C  -2.648908 0.586457 0.191427
C  -1.785662 1.816088 -0.171895
C  -4.116201 0.714864 -0.275571
C  -0.316887 1.676968 0.285271
C  -4.972054 -0.51435 0.100846
C  0.55615 2.908824 -0.082198
C  4.529073 -2.473229 0.378426
C  3.156511 -2.245531 -0.293859
C  -6.441194 -0.361436 -0.385377
C  5.597417 -1.411592 -0.017447
C  1.982864 2.761041 0.403864
C  2.084228 -3.269381 0.142718
C  3.075818 2.663479 -0.396798
C  4.49589 2.407941 0.090166
C  5.220349 -0.017201 0.439929
C  4.981809 1.042258 -0.375617
C  0.707519 -3.007737 -0.506968
C  -7.287799 -1.515596 -0.036417
H  -2.198175 -0.323175 -0.257936
H  -2.624895 0.434754 1.290595
H  -2.228631 2.725922 0.285147
H  -1.814338 1.973691 -1.27038
H  -4.138667 0.858708 -1.376051
H  -4.563372 1.628259 0.169561
H  0.132203 0.770938 -0.170339
H  -0.285128 1.522474 1.383883
H  -4.534558 -1.428989 -0.342893
H  -4.964778 -0.657153 1.19829
H  0.09115 3.81361 0.363749
H  0.54606 3.052461 -1.180859
H  4.908266 -3.481954 0.115425
H  4.40177 -2.464477 1.481367
H  3.277436 -2.288418 -1.397135
H  2.802074 -1.221052 -0.062492
H  5.736623 -1.419836 -1.11679
H  6.568314 -1.705115 0.433144
H  -6.461821 -0.229088 -1.484739
H  -6.889644 0.55067 0.054526
H  2.116836 2.687504 1.495814
H  1.983161 -3.24041 1.247219
H  2.426145 -4.293954 -0.110561
H  2.942266 2.722841 -1.489124
H  4.530993 2.464488 1.194463
H  5.170548 3.198109 -0.301522
H  5.094741 0.113667 1.527868
H  5.088425 0.911395 -1.464481
H  0.332475 -2.000399 -0.239978
H  0.774491 -3.05815 -1.610384
H  -0.045224 -3.748286 -0.178867
