program: Gaussian 09
title: 000106307
version: EM64L-G09RevD.01
frameworkgroup: C1[X(C19H21N2O)]
method: RPBEPBE
basis: SDD
operation: Freq
keyword: #p
keyword: freq=noraman
keyword: PBEPBE/SDD
title: #p freq=noraman PBEPBE/SDD
converged: YES YES NO NO
title: Mulliken charges:
elementType: O N N C C C C C C C C C C C C C C C C C C C H H H H H H H H H H H H H H H H H H H H H
charge: -0.253118 -0.223128 -0.396003 0.287689 0.190552 0.476777 -0.384023 -0.548821 0.371089 0.367207 -0.548781 -0.640122 -0.803779 -0.451040 -0.799646 -0.050552 0.526901 -0.421115 -0.349136 -0.185626 -0.207610 -0.234996 0.236837 0.251919 0.263132 0.277536 0.243209 0.251176 0.232038 0.254799 0.239439 0.244105 0.243718 0.244169 0.243437 0.242601 0.263829 0.327491 0.233481 0.232435 0.250769 0.246812 0.254350
chargesum: 1.00000
title: Mulliken charges with hydrogens summed into heavy atoms:
elementType: O N N C C C C C C C C C C C C C C C C C C C
charge: -0.253118 -0.223128 -0.068512 0.287689 0.190552 0.476777 0.104732 -0.285689 0.371089 0.367207 -0.271245 0.086301 -0.076516 -0.196241 -0.069439 0.213276 0.526901 -0.187635 -0.116701 0.065143 0.039203 0.019354
polarizability: 5.52974968e+02 -2.85391363e+00 2.35605206e+02 9.56517889e-01 -9.93184613e+00 1.04092002e+02
1716.lowfreq: -5.1749 -2.5600 -0.0008 -0.0007 0.0004 5.5740 16.5382 27.4621 30.9562
frequency: 16.1119 27.2427 30.9401 37.3889 67.5963 75.6393 112.7477 132.8574 147.2402 154.0946 182.3949 185.3998 202.4814 205.6180 236.4918 251.6047 280.7613 290.3036 304.0553 334.9452 360.9848 379.7127 399.1229 429.9505 437.4431 455.7780 468.1880 502.3773 534.2691 588.5611 602.5054 613.4613 630.0083 641.6418 662.5102 686.1551 719.0718 723.7998 725.3823 754.0656 772.0370 773.9585 792.9271 816.7215 827.3173 842.7463 863.9782 874.9989 908.6319 920.7645 952.9014 965.5105 974.6458 985.9243 1003.0191 1003.8138 1006.0742 1025.0392 1028.6862 1030.6094 1051.7430 1081.3134 1095.2201 1111.0943 1140.3369 1166.1131 1182.5641 1194.9166 1199.0876 1208.1610 1242.9172 1253.0116 1269.5263 1303.5292 1322.6183 1331.9308 1334.3935 1345.4647 1371.5621 1382.9772 1385.8776 1400.9821 1401.6869 1415.3300 1422.2856 1432.3729 1459.6284 1465.2752 1470.0065 1474.7216 1475.3961 1481.3943 1484.6357 1485.9688 1486.7324 1497.5441 1583.5133 1604.9911 1610.3257 1619.5323 1636.4268 1659.9833 2981.6649 2984.0000 3000.7351 3029.9433 3055.3291 3059.9365 3079.3963 3097.0281 3100.1493 3104.0963 3108.5642 3121.4597 3145.0061 3156.5756 3156.9563 3159.2130 3166.4950 3177.6425 3181.9394 3183.6272 3492.4501
redmass: 3.5821 3.1027 4.4884 4.1365 3.6576 3.9638 1.0872 4.4784 2.9430 2.7895 1.3030 1.3312 2.1416 3.6140 3.7626 1.8232 3.6901 3.9232 2.5538 3.4184 4.8281 4.2478 2.7845 2.9283 4.8185 5.0320 4.8613 2.9081 3.9053 4.9191 3.9026 6.1119 4.6786 4.2705 4.5352 1.8364 1.4167 4.2158 4.6520 4.2803 1.7039 3.6987 1.5107 1.5974 1.3737 3.8200 1.3761 1.3491 1.4381 3.1729 2.6013 1.2139 1.3613 5.9357 1.3366 1.4309 1.7407 2.3467 3.0757 1.4529 1.6472 2.3734 1.6035 2.6115 1.6568 4.1840 1.0639 1.2747 2.0101 2.6540 1.4977 1.3639 1.7391 2.8463 1.4770 1.4343 1.5207 1.9687 3.5048 4.5840 4.2193 1.2276 1.2300 1.3076 2.3390 2.0360 1.0465 2.4896 1.0486 1.0447 1.5278 1.2512 1.2031 1.8271 1.7180 1.1564 5.3882 5.9846 5.7458 6.0814 7.3480 4.9048 1.0382 1.0389 1.0363 1.0609 1.0967 1.0969 1.1034 1.0991 1.0984 1.1001 1.1026 1.0905 1.0872 1.0932 1.0909 1.0924 1.0961 1.0940 1.0943 1.0975 1.0760
irintensity: 0.0127 0.0637 0.4348 0.0589 0.1028 1.5713 0.0066 1.4097 2.7526 0.0279 0.3345 0.2990 1.7184 0.9478 0.0447 0.0947 2.7006 0.2433 0.1231 0.0122 0.7375 0.5224 0.0018 11.0803 3.9774 2.0215 3.0804 19.1002 0.0097 12.5193 1.1494 0.5708 0.3345 13.9702 0.8698 36.4996 2.8604 10.1152 13.7363 4.7653 82.9185 1.9277 8.5811 45.9602 41.7708 1.5484 27.4670 12.4605 2.3629 26.0951 27.2759 64.5884 4.2475 3.8040 1.5657 63.1393 5.2599 7.6410 6.1156 18.6145 0.0003 14.8309 8.2012 24.5856 15.1458 2.7641 1.3025 7.3261 1.0335 1.6889 55.1168 9.6595 0.2200 11.9591 150.8226 96.6018 69.8385 247.0436 43.2139 1.9209 8.3273 10.5271 10.6798 44.8560 12.8088 23.8089 0.0143 80.4439 12.4574 39.7197 32.2531 16.4980 1.1926 60.7696 31.1326 36.4136 106.8255 200.9457 115.2713 5.6663 76.4991 1650.1999 27.5906 7.0300 8.1325 18.1498 19.6746 0.9020 0.1724 23.8761 3.3043 21.5743 17.7651 8.5163 6.8257 3.9679 1.1191 2.1246 12.9808 0.3571 7.3815 5.7267 113.0671
temp: 298.150 k
press: 1.00000 atm
elementType: 8 7 7 6 6 6 6 6 6 6 6 6 6 6 6 6 6 6 6 6 6 6 1 1 1 1 1 1 1 1 1 1 1 1 1 1 1 1 1 1 1 1 1
symmnumber: 1
zpe: 933365.4 jmol-1
zpe.correction: 0.355500 hartree
zpe.thermalcorrener: 0.376438 hartree
zpe.thermalcorrenthalpy: 0.377382 hartree
zpe.thermalcorrgfe: 0.303535 hartree
zpe.sumelectzpe: -919.572899 hartree
zpe.sumelectthermal: -919.551962 hartree
zpe.sumelectthermalent: -919.551018 hartree
zpe.sumelectthermalfe: -919.624865 hartree
dipole: -0.3699 3.4084 -0.3326
dipole: 3.4446
quadrupole: -29.8734 -89.4902 -134.1898
quadrupole: 2.6837 -0.3402 -3.5405
quadrupole: 54.6444 -4.9724 -49.6720 2.6837 -0.3402 -3.5405
hfenergy: -919.9283995 hartree
pointgroup: C01 [X(C19H21N2O1)]
dipole: -0.1177232 -1.3447104 0.1201787 debye
polarizability: 552.7153431|9.5434037|236.0099589|0.6974902|-8.90636|103.9468754 unknown
InChI: InChI=1S/C19H21N2O/c1-4-21-17-12-14(2)15(3)13-18(17)22-19(21)10-11-20-16-8-6-5-7-9-16/h5-13,20H,4H2,1-3H3
charge 1 multiplicity 1
43 atoms
O  -0.735031 0.513895 0.022327
N  -1.638269 -1.550215 0.232731
N  3.255345 -0.83505 0.133004
C  -2.72676 -0.636425 0.13859
C  -2.160926 0.64752 0.015793
C  -0.459395 -0.848667 0.149392
C  -1.771398 -3.023442 0.331344
C  -4.12202 -0.799797 0.158677
C  -4.92909 0.361661 0.05442
C  -4.32992 1.667343 -0.068924
C  -2.917251 1.812633 -0.089294
C  -1.849984 -3.702806 -1.050389
C  -6.43825 0.222814 0.071902
C  0.868869 -1.32527 0.180605
C  -5.205019 2.899489 -0.177324
C  1.955586 -0.448427 0.103167
C  4.419216 -0.003256 0.048411
C  5.680952 -0.641463 0.153313
C  4.341836 1.400172 -0.135783
C  6.863081 0.122484 0.076723
C  5.531917 2.152396 -0.208937
C  6.794691 1.522832 -0.103728
H  -0.919222 -3.408177 0.917849
H  -2.680825 -3.226709 0.922263
H  -4.588556 -1.785075 0.249498
H  -2.449174 2.795556 -0.182507
H  -2.711689 -3.332372 -1.631258
H  -1.969838 -4.79206 -0.919274
H  -0.934395 -3.527439 -1.641328
H  1.022146 -2.404976 0.26458
H  -6.749743 -0.829526 0.172574
H  -6.88647 0.788398 0.910096
H  -6.891223 0.620608 -0.855464
H  -5.84635 3.018742 0.716231
H  -4.60366 3.816511 -0.28358
H  -5.884594 2.838443 -1.04795
H  1.765675 0.624069 0.013388
H  3.451915 -1.837361 0.230298
H  5.741927 -1.728016 0.295841
H  3.382203 1.918019 -0.228095
H  7.834045 -0.375558 0.158636
H  5.472136 3.236044 -0.351566
H  7.711912 2.116258 -0.163054
