program: Gaussian 09
title: 000106303
version: EM64L-G09RevD.01
frameworkgroup: C1[X(C14H21N3OS)]
method: RPBEPBE
basis: SDD
operation: Freq
keyword: #p
keyword: freq=noraman
keyword: PBEPBE/SDD
title: #p freq=noraman PBEPBE/SDD
converged: YES YES NO NO
title: Mulliken charges:
elementType: S O N N N C C C C C C C C C C C C C C H H H H H H H H H H H H H H H H H H H H H
charge: -0.012080 -0.259993 -0.193448 -0.140580 -0.127814 -0.470604 -0.373935 -0.541891 0.438062 -0.347272 -0.374725 0.241779 -0.270360 -0.706897 0.071949 -0.359962 -0.242747 -0.681063 -0.613475 0.234100 0.232600 0.237567 0.223843 0.255973 0.245497 0.223829 0.226384 0.234753 0.243511 0.227706 0.229389 0.232137 0.212499 0.254006 0.249245 0.235204 0.212895 0.248675 0.256817 0.248425
chargesum: 0.00000
title: Mulliken charges with hydrogens summed into heavy atoms:
elementType: S O N N N C C C C C C C C C C C C C C
charge: -0.012080 -0.259993 -0.193448 -0.140580 -0.127814 -0.003904 0.087475 -0.040421 0.438062 0.102941 -0.139972 0.241779 -0.026849 -0.017665 0.071949 0.106543 -0.242747 0.016280 0.140442
polarizability: 4.33799482e+02 -1.40999194e+01 2.05943897e+02 -1.00210119e-01 -4.64587519e+00 1.11949878e+02
1716.lowfreq: -3.8211 -0.0012 -0.0011 0.0005 1.6048 4.2958 25.1109 36.1132 49.9433
frequency: 24.8114 36.1054 49.9376 60.2875 84.1408 93.7114 96.4785 111.8993 124.7344 140.0170 149.0385 177.7092 181.9795 214.7805 221.0995 235.4858 246.5864 269.3747 287.4523 301.3588 320.2484 335.5388 373.3150 405.9492 466.5743 481.9727 502.4664 523.4990 571.3815 574.8300 606.8539 624.6578 646.0919 698.6185 727.9681 772.9244 790.0687 798.2793 822.8095 859.5266 872.1917 892.7096 910.2053 922.4109 940.1450 947.5274 977.0183 990.9757 1049.6280 1060.2254 1074.6381 1089.7997 1094.5198 1130.1780 1131.2419 1131.7905 1140.9865 1157.4696 1199.2392 1202.7877 1214.6460 1227.6636 1240.4131 1268.2987 1282.1799 1285.8272 1289.6378 1297.3156 1314.9858 1350.8394 1358.4309 1366.6618 1372.7517 1380.1162 1387.7695 1401.7378 1407.7237 1420.1977 1443.3368 1463.2735 1465.7746 1469.8636 1475.5057 1475.6804 1479.6060 1481.1996 1484.6519 1488.3045 1490.2331 1497.8465 1594.7041 1624.6861 1658.5415 2930.0350 2940.2059 2986.9342 2992.6324 2998.6014 2999.2180 3007.3462 3011.9153 3024.3475 3061.2157 3064.9534 3071.4577 3084.0123 3090.7406 3091.6285 3093.0982 3098.6557 3099.0259 3103.0403 3116.3949 3162.7068
redmass: 3.4407 5.4007 4.5828 2.5112 2.8517 1.0604 2.7550 2.7639 4.7067 2.4837 3.7207 5.2783 2.7365 1.1051 2.5928 4.1821 3.9082 3.5965 1.2106 3.6693 3.3847 2.6782 4.4475 3.5392 6.8445 3.5927 4.2779 3.7461 3.8877 3.5955 3.8281 3.2496 8.4445 3.1514 8.1229 3.1320 1.2978 1.1845 1.4880 1.8395 3.1009 1.7233 3.4478 1.2764 2.4848 2.6953 2.3188 1.9743 2.3661 2.9880 1.6969 2.0013 2.2316 1.7797 1.8901 1.3125 3.3906 1.2782 1.4994 2.4980 1.9654 1.7241 2.0515 1.6894 1.2899 1.5257 1.4050 1.9182 1.3907 1.9683 1.3201 2.7821 1.4973 2.9155 1.2298 1.2315 3.0347 2.3103 1.4347 1.0937 1.0449 1.0446 1.0934 1.0950 1.0514 1.0599 1.0719 1.0590 1.0704 1.1106 7.1153 10.1038 7.6432 1.0676 1.0705 1.0357 1.0361 1.0658 1.0325 1.0604 1.0931 1.0639 1.1021 1.0924 1.0959 1.0993 1.1019 1.0998 1.1003 1.1042 1.1014 1.0872 1.1018 1.0873
irintensity: 0.1359 0.1492 0.0294 0.2090 3.1383 0.0561 0.5179 2.6902 2.8613 3.1256 0.3351 1.1912 0.1557 0.9910 19.8475 2.4083 2.7982 0.8533 1.1474 13.0922 2.8277 0.4304 7.4088 1.0424 32.9933 3.8273 32.0075 38.7242 4.1902 3.8629 4.1612 7.4279 1.4756 2.3606 4.1264 3.3078 23.5847 21.1339 14.5472 15.5584 1.6165 19.5641 12.8131 23.1798 10.4823 45.6658 29.2952 20.6417 7.5952 30.8883 0.9704 2.5573 1.5532 15.6687 8.6766 0.5832 267.0649 10.7804 2.8257 26.6416 37.7958 5.8010 57.1382 293.2976 81.5681 3.5619 19.2215 369.2838 39.8017 169.6695 22.2099 8.0329 91.7093 261.3060 22.7731 14.3802 16.8975 49.0754 138.7273 1.1349 17.9031 10.0318 18.5836 16.1660 12.5521 28.3574 34.4277 11.2730 19.1886 22.1582 861.4534 303.9278 325.6356 33.8673 147.4314 20.5983 31.5449 9.7638 45.2354 26.2154 11.9161 29.0431 3.0091 48.8635 13.9316 34.2746 17.8748 34.4908 29.6539 37.7796 12.3429 1.1457 1.4499 16.9664
temp: 298.150 k
press: 1.00000 atm
elementType: 16 8 7 7 7 6 6 6 6 6 6 6 6 6 6 6 6 6 6 1 1 1 1 1 1 1 1 1 1 1 1 1 1 1 1 1 1 1 1 1
symmnumber: 1
zpe: 875755.1 jmol-1
zpe.correction: 0.333558 hartree
zpe.thermalcorrener: 0.353961 hartree
zpe.thermalcorrenthalpy: 0.354906 hartree
zpe.thermalcorrgfe: 0.283181 hartree
zpe.sumelectzpe: -1182.204575 hartree
zpe.sumelectthermal: -1182.184171 hartree
zpe.sumelectthermalent: -1182.183227 hartree
zpe.sumelectthermalfe: -1182.254951 hartree
dipole: 10.2042 1.5785 -0.2676
dipole: 10.3290
quadrupole: -110.8111 -126.1185 -123.3680
quadrupole: 6.3071 -3.2350 0.8805
quadrupole: 9.2881 -6.0193 -3.2688 6.3071 -3.2350 0.8805
hfenergy: -1182.5381321 hartree
pointgroup: C01 [X(C14H21N3O1S1)]
dipole: -4.0517868 -0.2965562 -0.0951984 debye
polarizability: 430.0814198|-32.1095493|209.5947309|-0.6877449|5.3691226|112.0171065 unknown
InChI: InChI=1S/C14H21N3OS/c1-4-16-10-6-7-11(16)8-9-12-13(18)15(3)14(19)17(12)5-2/h8-9H,4-7,10H2,1-3H3
charge 0 multiplicity 1
40 atoms
S  4.564599 -2.092646 -0.280465
O  2.461925 2.56578 0.21167
N  -3.619146 -0.043039 -0.063939
N  2.019225 -0.948952 -0.183224
N  3.696691 0.530355 -0.0057
C  -4.171703 2.229211 0.308945
C  -4.752478 0.902346 -0.235614
C  -2.649043 2.112833 0.025444
C  -2.394072 0.609191 -0.024231
C  -3.745555 -1.495044 -0.284483
C  -1.146121 -0.01433 -0.066957
C  1.403304 0.325442 -0.034335
C  0.076256 0.727522 0.007323
C  -5.139189 -2.052643 0.052159
C  2.505639 1.30785 0.074506
C  1.344668 -2.251668 -0.297039
C  3.413509 -0.833972 -0.15661
C  0.875862 -2.800763 1.067033
C  5.042536 1.096118 0.062711
H  -4.350286 2.293285 1.396485
H  -4.628789 3.111601 -0.167457
H  -5.639344 0.56387 0.324886
H  -5.034436 0.988583 -1.30776
H  -2.037396 2.614769 0.793057
H  -2.382384 2.565463 -0.949033
H  -3.485117 -1.741855 -1.338135
H  -2.995974 -1.99829 0.355908
H  -1.109866 -1.101982 -0.167407
H  0.000201 1.818657 0.119291
H  -5.412824 -1.842972 1.101393
H  -5.923897 -1.639399 -0.60553
H  -5.133359 -3.148246 -0.084804
H  0.50603 -2.15276 -1.008672
H  2.085076 -2.943128 -0.738099
H  1.74566 -2.961583 1.726672
H  0.180572 -2.1071 1.571701
H  0.365116 -3.771666 0.928827
H  5.603497 0.653886 0.903288
H  4.930356 2.182832 0.207731
H  5.596757 0.892643 -0.869237
