program: Gaussian 09
title: 000106268
version: EM64L-G09RevD.01
frameworkgroup: C1[X(C12H9N4O3S)]
method: RPBEPBE
basis: SDD
operation: Freq
keyword: #p
keyword: freq=noraman
keyword: PBEPBE/SDD
title: #p freq=noraman PBEPBE/SDD
converged: YES YES NO NO
title: Mulliken charges:
elementType: S O O O N N N N C C C C C C C C C C C C H H H H H H H H H
charge: 1.015641 -0.562576 -0.467169 -0.467905 -0.055772 -0.089108 -0.008127 0.137692 -0.059318 -0.183268 -0.185959 0.183210 -0.239395 -0.289157 0.262567 -0.256544 -0.291585 0.407415 -0.310409 -0.310198 0.302989 0.306961 0.292285 0.285458 0.300254 0.297849 0.289154 0.291370 0.403650
chargesum: 1.00000
title: Mulliken charges with hydrogens summed into heavy atoms:
elementType: S O O O N N N N C C C C C C C C C C C C
charge: 1.015641 -0.158927 -0.467169 -0.467905 -0.055772 -0.089108 -0.008127 0.137692 -0.059318 0.119720 0.121001 0.183210 0.052889 -0.003699 0.262567 0.043710 0.006263 0.407415 -0.021255 -0.018828
polarizability: 6.57172269e+02 -3.33791525e+00 1.59711977e+02 -1.51018257e+01 1.24194616e-01 1.01081300e+02
1716.lowfreq: 0.0012 0.0017 0.0018 1.0193 3.5406 6.6275 21.4803 25.2910 39.8554
frequency: 21.4372 25.2320 39.8102 43.9893 67.6951 98.6182 121.9305 139.1854 158.4954 173.4098 189.2741 212.3203 231.9664 269.3727 286.9590 309.1070 314.9805 360.2547 374.6691 393.5853 411.7397 415.4128 451.4350 480.8286 496.1781 524.6980 532.3774 546.7491 565.7178 608.6949 631.6819 639.0922 709.0821 727.2470 735.2631 805.6185 813.9862 824.5775 835.8173 846.5650 858.7840 870.2454 971.0798 974.1929 978.5664 986.2463 989.3897 994.6798 1002.0260 1040.3669 1053.8692 1111.8589 1122.7842 1134.0706 1168.3921 1180.9342 1205.3265 1269.7773 1289.1641 1302.2662 1359.1185 1373.7106 1396.0826 1409.1262 1447.1985 1459.0028 1465.2275 1507.0051 1562.4615 1585.7482 1593.3136 2069.2063 3160.2107 3164.9417 3166.7276 3172.1474 3178.7763 3182.6441 3184.1064 3190.3066 3477.4847
redmass: 6.6303 8.8693 6.5489 4.4512 8.0040 9.2789 7.9975 9.7065 9.6760 7.8896 1.6301 7.4497 4.8706 3.1450 7.7821 8.4173 8.4705 7.6135 5.6715 3.0285 3.7247 8.5761 5.9068 8.2154 6.8167 4.6868 3.9661 7.0793 5.4393 7.1536 7.6114 7.3126 4.2667 5.5122 3.6561 1.7899 4.4840 2.2927 9.1490 1.2532 2.1877 1.5487 16.5608 1.3836 1.5689 2.1027 3.6696 1.4460 1.3917 1.7373 1.5153 1.3563 1.3524 2.4217 1.4180 2.0030 1.7328 3.7318 1.2921 1.3441 4.2274 6.8915 4.1812 5.4059 2.0952 2.4349 5.3894 6.5156 7.1997 6.3645 6.1075 13.8595 1.0899 1.0902 1.0894 1.0898 1.0968 1.0983 1.0989 1.0998 1.0664
irintensity: 0.7818 0.2848 0.3351 0.7337 0.5943 3.2813 0.7928 5.6218 2.5988 4.9009 45.8917 16.8656 17.0009 74.9931 23.8931 8.6875 8.6407 1.8787 8.9818 2.2605 17.6557 89.1246 4.2451 0.6847 37.1864 64.3691 72.7238 18.1528 141.3910 0.5789 47.8054 102.7706 6.2403 73.8954 41.5259 52.2051 6.3438 105.4059 76.5615 5.3436 110.7485 96.2024 81.6385 3.3894 0.1462 0.8296 41.3778 0.5301 0.6780 24.1882 54.0675 19.5753 14.2104 633.6427 7.3667 15.8688 64.9479 20.7199 1.4089 7.6316 94.8216 570.4370 178.2587 86.4098 7.9871 16.8296 23.8969 39.4209 62.3831 355.6811 185.1940 1457.9855 7.3084 6.9898 1.1606 1.7527 2.2285 1.1486 3.1559 1.4637 102.2336
temp: 298.150 k
press: 1.00000 atm
elementType: 16 8 8 8 7 7 7 7 6 6 6 6 6 6 6 6 6 6 6 6 1 1 1 1 1 1 1 1 1
symmnumber: 1
zpe: 508673.8 jmol-1
zpe.correction: 0.193744 hartree
zpe.thermalcorrener: 0.212415 hartree
zpe.thermalcorrenthalpy: 0.213359 hartree
zpe.thermalcorrgfe: 0.144355 hartree
zpe.sumelectzpe: -1303.483511 hartree
zpe.sumelectthermal: -1303.464840 hartree
zpe.sumelectthermalent: -1303.463896 hartree
zpe.sumelectthermalfe: -1303.532900 hartree
dipole: -18.5010 -0.9155 1.6459
dipole: 18.5967
quadrupole: 2.3315 -106.4742 -118.9962
quadrupole: -7.0398 9.0039 -2.6168
quadrupole: 76.7111 -32.0945 -44.6166 -7.0398 9.0039 -2.6168
hfenergy: -1303.677255 hartree
pointgroup: C01 [X(C12H9N4O3S1)]
dipole: 7.2640932 -0.7994782 0.3533198 debye
polarizability: 655.5684196|-32.2824709|104.3219035|-8.110379|10.5479721|158.0752232 unknown
InChI: InChI=1S/C12H9N4O3S/c13-14-9-1-3-10(4-2-9)15-16-11-5-7-12(8-6-11)20(17,18)19/h1-8,17H
charge 1 multiplicity 1
29 atoms
S  -5.687055 0.144582 0.011729
O  -5.746681 -1.44355 0.95248
O  -6.336547 1.331847 0.891703
O  -6.106432 -0.110026 -1.526624
N  0.342005 0.617466 0.424672
N  1.111251 0.187619 -0.537248
N  6.597474 -0.423364 0.151052
N  7.748019 -0.555726 0.27773
C  -3.801861 0.257807 0.120213
C  -3.051878 -0.325284 -0.922819
C  -3.25121 0.947166 1.213073
C  -1.053587 0.466021 0.239574
C  -1.654751 -0.217256 -0.863981
C  -1.848642 1.051724 1.269081
C  2.48656 0.091932 -0.300714
C  3.028352 -0.228739 0.99042
C  3.348728 0.210545 -1.437809
C  5.246498 -0.258817 0.000941
C  4.401015 -0.396981 1.15335
C  4.72544 0.046549 -1.302364
H  -3.559265 -0.826633 -1.753209
H  -3.896441 1.393044 1.975981
H  -1.020843 -0.64251 -1.647366
H  -1.348085 1.571644 2.091129
H  2.350661 -0.32724 1.843256
H  2.907627 0.432463 -2.413391
H  4.833152 -0.61735 2.134126
H  5.395744 0.143247 -2.16102
H  -6.701447 -1.732082 1.049234
