program: Gaussian 09
title: 000106251
version: EM64L-G09RevD.01
frameworkgroup: C1[X(C9H18O2)]
method: RPBEPBE
basis: SDD
operation: Freq
keyword: #pfreq=noraman
keyword: PBEPBE/SDD
title: #p freq=noraman PBEPBE/SDD
converged: YES YES NO YES
title: Mulliken charges:
elementType: O O C C C C C C C C C H H H H H H H H H H H H H H H H H H
charge: -0.273049 -0.241154 -0.067152 0.012697 0.043564 -0.392264 -0.373257 -0.334670 -0.744693 -0.718205 -0.708978 0.200728 0.188382 0.181583 0.197604 0.226097 0.226542 0.182512 0.231759 0.180963 0.226168 0.208020 0.240938 0.233076 0.202257 0.227511 0.214289 0.206692 0.222042
chargesum: 0.00000
title: Mulliken charges with hydrogens summed into heavy atoms:
elementType: O O C C C C C C C C C
charge: -0.273049 -0.241154 0.133575 0.201079 0.225147 0.031437 0.035796 0.078052 -0.069568 -0.055361 -0.065956
polarizability: 1.21032788e+02 6.54034253e-01 9.85617678e+01 1.60680730e-02 -4.25556926e-02 8.91385089e+01
1716.lowfreq: -11.3017 -10.0358 -0.0006 -0.0005 0.0005 14.5031 57.1722 67.8035 102.7017
frequency: 57.1633 67.7143 102.6821 131.5005 163.3147 194.3469 204.7823 235.3464 247.9042 272.8445 296.8654 313.9316 346.3846 417.4155 435.0598 463.0825 496.3226 609.4496 633.2318 768.7763 804.0030 813.2250 854.1603 863.1421 894.0345 899.7010 949.2113 962.9989 969.7249 986.0146 1021.5387 1032.8165 1061.4855 1083.6379 1108.1477 1141.2701 1150.9853 1165.4328 1183.5611 1206.8669 1224.8883 1256.7327 1285.4835 1292.6079 1301.5010 1325.0229 1339.7538 1349.1884 1357.6065 1362.8048 1367.4942 1384.9577 1390.1124 1391.2672 1435.8785 1459.2373 1463.7119 1466.2767 1469.4994 1479.0814 1479.7469 1485.9247 1492.6376 2862.3026 2906.1869 2931.1686 2965.8820 2975.1902 2981.8531 2989.2113 2993.1417 2994.0154 3032.9927 3062.9208 3068.8776 3076.0641 3084.9181 3089.2607 3089.7942 3097.6022 3098.3512
redmass: 2.7317 2.0223 3.0098 2.5811 3.5092 1.0365 1.0784 1.2766 2.4951 2.4799 2.8086 2.6139 2.8003 5.3253 2.3733 2.1813 3.8288 2.5080 3.6306 1.3131 2.4026 2.3391 2.2998 2.9518 3.5409 3.3463 1.7355 1.2886 1.2468 1.7926 2.0699 2.7491 2.6358 2.7277 1.7503 2.1814 1.9542 2.2140 1.8824 1.3638 1.2245 1.3061 1.1796 1.1795 1.2756 1.4641 1.2258 1.5536 1.4181 1.3679 1.4500 1.2585 1.2432 1.2734 1.0950 1.0473 1.0911 1.0652 1.0496 1.0496 1.0458 1.0682 1.0495 1.0823 1.0829 1.0696 1.0627 1.0374 1.0823 1.0412 1.0522 1.0383 1.0968 1.1007 1.0990 1.1000 1.0955 1.0994 1.0995 1.1001 1.0996
irintensity: 0.0447 0.2600 2.8470 0.5318 2.7259 0.0214 0.2066 0.5419 1.5127 2.2856 1.4513 2.9135 2.8309 5.3371 1.9493 1.8558 0.6435 4.4623 2.8257 8.5013 1.5479 11.9826 7.2847 6.5486 61.0847 70.8364 3.3702 2.7391 12.2944 29.6091 6.1489 58.8068 19.4007 113.3378 10.6786 19.3991 23.6398 2.8061 2.8707 7.2864 9.8202 1.0578 2.1213 29.0832 1.8551 1.9127 13.3643 6.5135 8.3511 2.2147 6.8613 14.9868 22.8916 23.4479 8.7056 11.5935 11.3948 0.0355 11.3227 6.4970 10.7687 14.9252 13.8377 66.4711 47.9623 94.3306 50.1415 33.1042 21.1070 10.6710 51.1713 18.5690 11.4379 28.3850 52.0213 62.6696 34.1577 59.0481 16.3653 26.9447 28.2191
temp: 298.150 k
press: 1.00000 atm
elementType: 8 8 6 6 6 6 6 6 6 6 6 1 1 1 1 1 1 1 1 1 1 1 1 1 1 1 1 1 1
symmnumber: 1
zpe: 674521.7 jmol-1
zpe.correction: 0.256912 hartree
zpe.thermalcorrener: 0.269578 hartree
zpe.thermalcorrenthalpy: 0.270522 hartree
zpe.thermalcorrgfe: 0.218527 hartree
zpe.sumelectzpe: -503.273670 hartree
zpe.sumelectthermal: -503.261004 hartree
zpe.sumelectthermalent: -503.260059 hartree
zpe.sumelectthermalfe: -503.312055 hartree
dipole: -1.9940 0.4111 -1.5092
dipole: 2.5343
quadrupole: -61.6436 -71.7452 -68.3951
quadrupole: 0.5121 0.8708 0.5755
quadrupole: 5.6177 -4.4839 -1.1338 0.5121 0.8708 0.5755
hfenergy: -503.5305818 hartree
pointgroup: C01 [X(C9H18O2)]
dipole: -0.7805924 0.1708016 -0.5963898 debye
polarizability: 121.0433363|0.4220537|98.550776|0.1343876|-0.0257721|89.1389521 unknown
InChI: InChI=1S/C9H18O2/c1-4-7(2)9-10-6-5-8(3)11-9/h7-9H,4-6H2,1-3H3
charge 0 multiplicity 1
29 atoms
O  -0.468496 0.773057 0.154295
O  -0.529195 -1.643269 -0.000474
C  1.61985 -0.491836 0.042918
C  0.15804 -0.418854 -0.420597
C  -1.884415 0.904427 -0.280095
C  -2.656593 -0.371392 0.125984
C  2.424717 0.68885 -0.565186
C  -1.939838 -1.614695 -0.437561
C  1.714221 -0.560323 1.584198
C  -2.417727 2.185806 0.358199
C  3.948635 0.578645 -0.345608
H  2.016109 -1.439301 -0.378745
H  0.082627 -0.345685 -1.536213
H  -1.895073 0.992635 -1.392997
H  -3.695784 -0.326159 -0.255591
H  -2.692801 -0.43364 1.229207
H  2.044741 1.635273 -0.135645
H  2.223085 0.736354 -1.656118
H  -2.381355 -2.554354 -0.06916
H  -1.978389 -1.608486 -1.550965
H  1.356589 0.382273 2.034579
H  2.755817 -0.73344 1.907243
H  1.090243 -1.384263 1.969845
H  -1.812316 3.053681 0.044921
H  -3.467455 2.360709 0.059788
H  -2.370886 2.1118 1.458971
H  4.480923 1.40449 -0.852647
H  4.341465 -0.374382 -0.749106
H  4.211159 0.623778 0.726659
