program: Gaussian 09
title: 000108184
version: EM64L-G09RevD.01
frameworkgroup: C1[X(C18H14O3)]
method: RPBEPBE
basis: SDD
operation: Freq
keyword: #pfreq=noraman
keyword: PBEPBE/SDD
title: #p freq=noraman PBEPBE/SDD
converged: YES YES NO NO
title: Mulliken charges:
elementType: O O O C C C C C C C C C C C C C C C C C C H H H H H H H H H H H H H H
charge: -0.311449 -0.446127 -0.441378 -0.197017 -0.330067 -0.153993 0.227643 -0.291294 0.261700 0.097264 -0.440516 0.447697 0.164666 -0.472250 0.411413 -0.469785 -0.487984 -0.375186 -0.446829 -0.271244 -0.247648 0.246292 0.295151 0.257694 0.266812 0.250837 0.367969 0.245657 0.345960 0.242185 0.240936 0.303524 0.242278 0.234114 0.232973
chargesum: 0.00000
title: Mulliken charges with hydrogens summed into heavy atoms:
elementType: O O O C C C C C C C C C C C C C C C C C C
charge: -0.311449 -0.078158 -0.095418 0.049275 -0.034916 0.103700 0.227643 -0.024482 0.261700 0.097264 -0.189679 0.447697 0.164666 -0.226593 0.411413 -0.227600 -0.247048 -0.071662 -0.204551 -0.037129 -0.014675
polarizability: 2.98029830e+02 2.25580968e+01 2.32186886e+02 -2.22693313e+00 -8.55449273e+00 1.03677576e+02
1716.lowfreq: -9.3243 -4.0323 -1.4035 -0.0005 -0.0002 0.0003 49.4860 52.3249 86.0486
frequency: 49.4526 52.3205 86.0457 109.9890 134.7380 147.3402 165.2917 196.0049 223.9815 250.9641 258.4411 289.4650 317.8892 369.9253 397.0400 415.1358 419.5798 455.7032 464.7840 476.9451 479.4266 520.5049 533.1259 544.2477 571.9812 589.3932 624.5968 632.9520 655.7499 678.8559 694.7128 729.5518 756.3165 763.7473 786.8847 815.1688 819.4260 832.0913 833.7398 850.8961 863.9257 890.9368 898.6507 941.8766 962.7567 971.2112 975.8217 988.7256 995.8400 1009.9082 1013.9566 1052.9803 1077.2128 1094.5528 1109.5721 1139.7386 1165.7774 1182.4307 1183.8902 1191.7045 1204.0723 1223.5919 1234.0873 1234.8184 1247.9481 1256.1781 1283.4555 1304.6539 1321.0386 1331.1607 1357.1624 1359.5494 1389.1249 1393.9215 1401.6351 1416.3363 1425.5499 1437.7254 1454.8670 1508.1810 1526.8770 1568.4900 1600.1682 1616.6141 1629.4414 3055.8815 3067.1181 3108.2621 3122.0093 3124.0475 3128.1944 3133.6355 3138.3935 3147.3690 3152.5002 3160.7639 3197.0229 3436.1684 3558.8986
redmass: 6.3437 5.8285 5.6681 4.3044 3.9127 4.4861 1.7981 2.8311 4.6848 4.5955 5.6016 5.7025 5.1725 5.2721 5.9415 4.0081 4.0532 3.3255 3.3426 2.5022 2.1294 5.7688 3.7991 3.6679 4.7661 4.5488 6.2077 4.5908 5.8703 5.0992 4.3857 4.9162 3.6077 1.3066 3.9483 3.4895 1.5863 5.3946 5.0602 3.3515 1.6992 1.7921 3.3062 6.1681 1.3599 1.7021 2.4431 1.4353 1.4015 2.9606 2.6717 2.0831 1.8322 1.6395 1.6970 1.6561 1.2798 1.1741 1.2726 1.4559 1.7656 1.2557 1.7388 2.0212 1.5392 1.7097 1.7147 1.6528 1.1401 1.8835 2.6823 1.5759 3.6585 5.1598 1.6471 2.0052 4.0445 2.9649 2.3670 3.4726 4.3672 7.4957 6.4642 6.2000 6.7763 1.0864 1.0872 1.0881 1.0867 1.0866 1.0874 1.0937 1.0906 1.0990 1.0977 1.0985 1.0936 1.0651 1.0667
irintensity: 0.3458 1.4878 1.5757 7.1816 33.9379 10.0967 55.4809 3.8587 4.1786 1.0183 0.4307 6.2186 2.9010 3.5150 4.8779 7.8409 2.2944 43.2929 18.8883 14.0851 32.4442 2.9124 7.6771 15.0903 6.0086 4.7359 23.7701 9.7517 16.3126 11.7628 8.6830 1.3875 1.8829 52.9278 6.6969 3.4470 8.3682 42.2978 11.4676 6.6521 88.8877 41.8880 24.0029 50.3847 1.2175 9.0702 4.8625 0.6813 2.5794 43.0803 9.9893 4.6925 4.3749 3.8090 7.1192 6.8179 3.1199 19.7584 28.1325 21.8023 3.8958 27.9576 6.0019 0.8253 22.7149 9.4936 7.9352 1.7119 35.6373 7.2289 13.3309 65.1297 18.2590 3.4821 34.4084 3.6313 0.1476 0.9460 5.3326 6.3004 5.3406 0.2060 1.7387 2.2927 1.5528 27.6798 21.7833 3.9144 0.7066 3.0001 3.6299 26.7269 13.2467 26.9811 24.7504 31.5850 9.2249 24.8802 11.9407
temp: 298.150 k
press: 1.00000 atm
elementType: 8 8 8 6 6 6 6 6 6 6 6 6 6 6 6 6 6 6 6 6 6 1 1 1 1 1 1 1 1 1 1 1 1 1 1
symmnumber: 1
zpe: 711555.5 jmol-1
zpe.correction: 0.271017 hartree
zpe.thermalcorrener: 0.287268 hartree
zpe.thermalcorrenthalpy: 0.288213 hartree
zpe.thermalcorrgfe: 0.227854 hartree
zpe.sumelectzpe: -918.499130 hartree
zpe.sumelectthermal: -918.482879 hartree
zpe.sumelectthermalent: -918.481934 hartree
zpe.sumelectthermalfe: -918.542293 hartree
dipole: -3.6488 1.0445 2.2552
dipole: 4.4148
quadrupole: -122.7921 -109.6938 -126.9557
quadrupole: -0.5589 3.9934 -6.9298
quadrupole: -2.9783 10.1201 -7.1418 -0.5589 3.9934 -6.9298
hfenergy: -918.770147 hartree
pointgroup: C01 [X(C18H14O3)]
dipole: -1.4382928 -0.4270556 -0.8751358 debye
polarizability: 298.9170669|-21.3545413|231.5304105|-0.3573579|-6.4925472|103.4468145 unknown
InChI: InChI=1S/C18H14O3/c19-15-12-8-7-10-6-5-9-3-1-2-4-11(9)13(10)14(12)17-18(21-17)16(15)20/h1-8,15-20H
charge 0 multiplicity 1
35 atoms
O  1.421812 2.440303 0.434993
O  3.512151 1.231734 1.64383
O  3.847629 -0.563167 -1.625571
C  2.499774 1.941212 -0.50508
C  1.131654 1.347495 -0.632344
C  3.57979 1.095258 0.190201
C  0.858455 -0.042902 -0.160919
C  3.400225 -0.385909 -0.214142
C  1.981941 -0.900899 -0.015844
C  -0.485859 -0.546128 0.012508
C  1.795324 -2.282936 0.256101
C  -0.64031 -1.975175 0.18173
C  -1.703812 0.28348 0.006993
C  0.507009 -2.813514 0.31751
C  -2.995116 -0.371089 -0.048087
C  -1.953365 -2.578767 0.183328
C  -3.086195 -1.811078 0.022277
C  -1.7055 1.713846 0.114513
C  -4.193282 0.404428 -0.111289
C  -2.897187 2.453349 0.069651
C  -4.152878 1.802334 -0.072863
H  2.825508 2.690755 -1.233982
H  0.471491 1.733293 -1.418577
H  4.584157 1.420185 -0.12802
H  4.106989 -0.989927 0.37777
H  2.673175 -2.927212 0.373658
H  2.615065 1.6155 1.85574
H  0.355824 -3.88844 0.469043
H  3.058882 -0.49732 -2.222224
H  -2.022327 -3.667211 0.291371
H  -4.079031 -2.274028 -0.015115
H  -0.778739 2.258029 0.298255
H  -5.15399 -0.121033 -0.16851
H  -2.855325 3.543856 0.164838
H  -5.077139 2.388176 -0.117542
