program: Gaussian 09
title: 000108141
version: EM64L-G09RevD.01
frameworkgroup: C1[X(C7H8N2O)]
method: RPBEPBE
basis: SDD
operation: Freq
keyword: #pfreq=noraman
keyword: PBEPBE/SDD
title: #p freq=noraman PBEPBE/SDD
converged: YES YES NO NO
title: Mulliken charges:
elementType: O N N C C C C C C C H H H H H H H H
charge: -0.436988 -0.081220 -0.307621 0.367647 -0.340015 -0.397675 -0.433710 0.123316 -0.266057 -0.310247 0.270948 0.238049 0.202139 0.241004 0.277062 0.255093 0.340586 0.257689
chargesum: 0.00000
title: Mulliken charges with hydrogens summed into heavy atoms:
elementType: O N N C C C C C C C
charge: -0.096402 -0.081220 -0.049932 0.367647 -0.069067 -0.159625 0.009433 0.123316 0.011005 -0.055155
polarizability: 1.54337320e+02 -1.04853792e+01 9.23276957e+01 4.02608116e+00 1.96100750e+00 4.54653729e+01
1716.lowfreq: -11.0197 -8.9924 0.0006 0.0006 0.0008 4.6104 53.1500 79.1385 135.2885
frequency: 53.1149 79.1273 135.2878 184.2836 258.6665 306.1515 352.5071 381.4949 410.0854 467.8722 525.2081 601.0003 627.6006 705.0918 743.6288 811.2149 829.7224 859.9356 921.8726 956.1614 979.7517 984.3677 1000.8435 1007.0056 1106.7369 1132.2039 1159.6051 1188.8816 1209.6377 1283.0031 1302.9080 1346.3598 1364.0982 1399.8290 1419.8388 1457.9643 1462.5458 1484.4858 1581.9264 1613.3497 2960.7234 3048.1931 3126.7714 3142.8320 3161.5226 3165.9085 3172.9305 3555.8931
redmass: 3.5960 4.9801 5.8881 4.4324 4.1830 2.4247 5.2361 1.4633 2.9159 2.8944 3.7783 5.4191 7.0504 3.1463 3.6723 2.9199 1.6138 1.2377 1.3548 2.2421 2.3059 1.6275 1.6230 2.0602 1.3129 1.9528 1.1225 1.4646 3.4215 1.3140 1.4707 1.8063 1.4303 5.3775 3.0104 2.0934 1.1258 2.3012 6.8965 6.2702 1.0668 1.0952 1.0892 1.0880 1.0951 1.0963 1.0751 1.0662
irintensity: 3.7220 0.0663 0.7955 2.7961 2.4644 55.5669 4.9002 139.6117 0.6557 42.5292 22.6674 9.3443 2.2184 18.2453 24.7089 12.9204 14.0129 0.5208 69.5902 65.0312 38.6714 0.1737 2.6772 2.0298 8.5999 62.6047 21.1730 9.1484 7.8455 5.0792 24.9398 20.0998 62.8158 1.2408 22.5633 36.1008 9.0090 6.4153 3.4581 15.0801 56.7967 14.8187 12.3134 1.7004 9.3116 2.0636 16.3045 7.8476
temp: 298.150 k
press: 1.00000 atm
elementType: 8 7 7 6 6 6 6 6 6 6 1 1 1 1 1 1 1 1
symmnumber: 1
zpe: 365041.3 jmol-1
zpe.correction: 0.139037 hartree
zpe.thermalcorrener: 0.148199 hartree
zpe.thermalcorrenthalpy: 0.149143 hartree
zpe.thermalcorrgfe: 0.104192 hartree
zpe.sumelectzpe: -455.474884 hartree
zpe.sumelectthermal: -455.465722 hartree
zpe.sumelectthermalent: -455.464778 hartree
zpe.sumelectthermalfe: -455.509729 hartree
dipole: -0.3414 1.4584 0.7770
dipole: 1.6874
quadrupole: -60.9948 -56.4799 -57.6465
quadrupole: -5.0869 -2.0410 -0.7035
quadrupole: -2.6210 1.8939 0.7272 -5.0869 -2.0410 -0.7035
hfenergy: -455.613921 hartree
pointgroup: C01 [X(C7H8N2O1)]
dipole: -0.1432821 -0.6218787 -0.1828701 debye
dipolederiv: -0.8303978 -0.0054501 -0.2010829 0.0322211 -0.4737335 0.1860778 -0.3039773 0.2063466 -0.3421068 0.9667223 0.151408 -0.0843461 0.261273 -0.1274615 -0.0114543 -0.0967855 -0.0046378 -0.0843705 -0.4228351 -0.1680402 0.0294394 -0.7071712 -0.2080259 0.0339425 0.1025855 0.0046318 -0.2746237 0.1863756 0.0028519 -0.0700209 0.0219178 0.0303086 0.0304259 -0.1488303 0.0123989 -0.0598051 -0.2880269 -0.1747276 0.0165008 -0.2164646 0.0147419 0.0057508 0.0874319 0.0067573 -0.167909 -0.2271181 0.1645469 -0.0231902 0.2132389 0.0357701 -0.0459005 -0.0442603 -0.0447548 -0.162078 0.4923521 -0.0407573 0.1338007 -0.043357 0.4275632 -0.1281419 0.2842535 -0.1393249 0.3988473 -0.5847147 -0.04705 0.0377865 0.2207495 0.0457525 -0.0121702 0.0105756 -0.0036069 -0.0084775 0.0812221 0.1398707 -0.0218505 -0.1119716 -0.0347827 -0.0026498 0.0023468 -0.0190952 -0.0855717 0.1614738 -0.1230753 -0.0107143 0.0847763 0.0627904 -0.0211831 -0.0126889 -0.0111783 -0.1017651 0.0578955 0.0734877 0.0043089 0.0699075 -0.0071321 0.0103557 0.0073692 0.0136071 0.1499534 0.0163973 -0.1041128 0.0173026 -0.0924028 -0.0448256 0.0263623 0.0087939 0.0247881 0.1488412 -0.0026791 -0.0150954 -0.0361505 -0.1004596 -0.2017863 0.0195377 -0.0515772 -0.0140862 0.0518643 -0.0409663 0.0130347 0.0455413 0.0910066 0.0722684 -0.0504128 0.0142923 -0.0067524 -0.0804686 0.0940066 -0.0664633 0.0084077 -0.032552 0.0213273 0.0163798 -0.0073182 0.0218729 0.1543376 0.05606 0.0864301 -0.0051091 0.0629502 -0.0113644 0.0138382 -0.0015048 0.0113989 0.1587139 0.3992328 0.0522387 0.1454877 0.0755178 0.2385665 -0.0688376 0.1509438 -0.0621285 0.0791577 -0.115 0.0609031 0.0138889 0.1708202 0.160023 -0.0019204 -0.0016501 0.0037634 0.2254607 unknown
polarizability: 154.4930617|8.6115142|90.9662199|-6.7703011|-7.4285318|46.671107 unknown
InChI: InChI=1S/C7H8N2O/c8-9-7-3-1-6(5-10)2-4-7/h1-4,8,10H,5H2
charge 0 multiplicity 1
18 atoms
O  -3.530944 0.847068 -0.454147
N  2.894142 -0.318238 -0.001628
N  3.524667 0.804277 -0.189612
C  -1.371259 -0.185558 0.267287
C  -0.657943 1.032759 0.083288
C  -0.651956 -1.403665 0.346358
C  -2.888861 -0.173284 0.388036
C  1.456651 -0.19045 0.078694
C  0.743664 1.037734 -0.01038
C  0.755616 -1.407629 0.258763
H  -1.225728 1.967342 0.018564
H  -1.192484 -2.348951 0.476849
H  -3.295828 -1.184566 0.175385
H  -3.197305 0.105431 1.411657
H  1.308853 1.965215 -0.148426
H  1.333431 -2.335838 0.319111
H  -3.271594 0.692965 -1.398296
H  4.549478 0.572687 -0.225205
