program: Gaussian 09
title: 000108115
version: EM64L-G09RevD.01
frameworkgroup: C1[X(C8H11NO2)]
method: RPBEPBE
basis: SDD
operation: Freq
keyword: #p
keyword: freq=noraman
keyword: PBEPBE/SDD
title: #p freq=noraman PBEPBE/SDD
converged: NO YES NO NO
title: Mulliken charges:
elementType: O O N C C C C C C C C H H H H H H H H H H H
charge: -0.270435 -0.422495 -0.371635 0.332890 0.403343 -0.352953 -0.333802 -0.385874 -0.365618 -0.242383 -0.685913 0.247514 0.242060 0.224959 0.249709 0.204582 0.204873 0.205220 0.231209 0.231112 0.287842 0.365793
chargesum: 0.00000
title: Mulliken charges with hydrogens summed into heavy atoms:
elementType: O O N C C C C C C C C
charge: -0.270435 -0.056702 -0.083793 0.332890 0.403343 -0.105439 -0.091743 -0.160915 -0.115909 0.167073 -0.018371
polarizability: 1.59530596e+02 1.03573772e-01 1.01369701e+02 -2.31908711e+00 2.06445056e+00 5.44836371e+01
1716.lowfreq: -2.8746 -0.0007 -0.0005 0.0006 4.9217 13.7490 52.4838 70.1986 114.8857
frequency: 52.4807 70.1962 114.8848 124.4701 150.0916 222.6269 240.6479 306.5349 319.9009 373.9745 378.7230 411.9899 481.6224 509.1013 556.8564 625.2579 655.2301 709.4121 758.8121 801.1607 814.4454 834.0469 848.5977 904.6363 924.0698 943.1317 960.2810 996.2994 1041.0244 1113.9046 1120.4204 1137.7915 1171.5121 1212.9031 1239.2601 1263.7268 1299.7227 1301.1318 1355.7037 1372.0967 1399.0785 1419.0608 1447.1128 1460.1721 1477.9558 1487.9542 1501.9226 1591.8018 1631.1519 2947.4851 2995.9972 3003.2181 3093.2980 3104.3591 3123.2995 3153.0307 3165.0666 3177.9180 3420.7973 3529.1039
redmass: 3.8851 4.0567 1.7279 4.1558 4.3519 4.7517 1.2083 3.9796 2.1781 3.0483 2.0980 2.9409 3.8035 2.5410 5.0685 6.3549 2.7555 3.8047 3.3889 1.2561 1.6423 1.1491 3.2139 3.1384 1.3711 1.3410 2.9756 2.5976 2.9155 1.7942 1.4901 1.4439 1.1774 2.6977 2.5460 1.1380 1.4530 1.3209 2.4912 1.3501 1.2700 3.5026 1.5524 1.0402 1.0921 1.2586 1.8423 6.2000 6.4814 1.0553 1.0361 1.1072 1.0989 1.1012 1.0890 1.0877 1.0949 1.0951 1.0765 1.0684
irintensity: 0.7373 3.6894 2.5376 1.7176 0.8111 0.9107 0.7653 8.6951 32.9123 27.3627 32.4706 6.2133 8.6063 37.2168 7.7330 18.5427 259.7005 6.8970 13.7872 3.5487 83.4795 1.9119 57.9282 26.5532 1.7144 0.9825 53.1158 5.8484 63.7994 0.4107 14.0393 4.4140 23.7280 217.9520 59.0782 0.0517 15.1708 65.1679 2.9883 11.4146 33.3232 18.7579 30.9071 11.5354 39.8254 82.5219 106.6547 10.5805 2.2534 43.1010 27.5890 42.1933 30.7184 36.4757 16.1838 13.1255 9.6067 4.6065 1.0272 26.2883
temp: 298.150 k
press: 1.00000 atm
elementType: 8 8 7 6 6 6 6 6 6 6 6 1 1 1 1 1 1 1 1 1 1 1
symmnumber: 1
zpe: 465637.2 jmol-1
zpe.correction: 0.177352 hartree
zpe.thermalcorrener: 0.188528 hartree
zpe.thermalcorrenthalpy: 0.189472 hartree
zpe.thermalcorrgfe: 0.140128 hartree
zpe.sumelectzpe: -515.746424 hartree
zpe.sumelectthermal: -515.735249 hartree
zpe.sumelectthermalent: -515.734304 hartree
zpe.sumelectthermalfe: -515.783649 hartree
dipole: 0.1015 -0.9471 -0.5592
dipole: 1.1045
quadrupole: -52.5291 -58.5044 -69.5017
quadrupole: 5.9199 -3.0705 3.5211
quadrupole: 7.6493 1.6740 -9.3233 5.9199 -3.0705 3.5211
hfenergy: -515.9237762 hartree
pointgroup: C01 [X(C8H11N1O2)]
dipole: -0.0420751 -0.3727535 0.2193378 debye
dipolederiv: -1.9524192 0.2767195 0.0407766 0.2932293 -0.3755579 -0.0056856 0.0392091 -0.0054064 -0.2831699 -0.6941555 -0.0477099 -0.098001 -0.308584 -0.414431 0.0227632 -0.4402531 -0.0797205 -0.026976 -0.7884644 0.140683 0.1843602 0.3981299 0.1707468 -0.0975795 0.858951 -0.0459599 -0.2578201 1.5586383 -0.1303409 -0.0338235 0.134462 -0.1086883 0.0003758 -0.0393832 0.0019727 0.065453 1.1126806 0.0381929 -0.103961 -0.1378027 -0.2131592 -0.01367 -0.1683455 -0.0063674 0.0280956 -0.2009084 -0.1011449 -0.0026778 0.2259772 0.0814132 -0.0164185 0.0044191 0.0059102 -0.1582076 -0.1962123 0.1549097 -0.0162594 -0.2858302 0.0504131 0.00384 -0.0042446 -0.0072441 -0.1916874 -0.165125 0.1028663 -0.0115014 -0.1927386 0.1261684 0.0121892 -0.048355 -0.0068022 -0.1893306 -0.1562858 -0.1548079 0.0204752 0.2606278 0.0748265 -0.0182422 0.0326964 0.0221866 -0.1818 0.8135981 -0.2069816 -0.0067168 -0.6400273 0.4800737 0.0169136 0.0047539 0.0046689 0.4065046 -0.1525046 -0.0191622 0.0064723 0.0179904 0.0637864 -0.0007445 0.0057302 0.0001955 0.0562994 0.0516939 -0.0858679 0.0050873 -0.0786253 -0.0224359 0.0089287 0.0068226 0.0075654 0.1663885 0.0315772 0.0930848 0.0011561 0.116671 -0.0362332 0.0011073 -0.0038827 0.0004194 0.162573 0.0020003 0.1146134 0.0012134 0.0967414 -0.0478008 0.005865 -0.002279 0.0040238 0.1600606 0.0592376 -0.0661312 0.0099313 -0.0655823 -0.0224762 0.0073866 0.0152485 0.0000604 0.16468 -0.0205697 -0.0419742 0.0712499 0.1041314 -0.0601785 0.0908759 0.0180432 0.1205129 -0.1061029 -0.0269964 -0.0525943 -0.0730834 0.0973706 -0.0711804 -0.0981409 -0.027566 -0.1192695 -0.0895295 -0.0513261 0.1005856 0.0020559 0.1477803 -0.0768475 0.0007202 0.000863 0.0021251 0.112827 0.083621 -0.0124747 0.0157877 -0.0780733 0.0394919 0.1057945 0.0545795 0.1017022 -0.0704544 0.0795028 -0.0193769 -0.0231945 -0.0869619 0.0286548 -0.1061422 -0.0585275 -0.1058371 -0.055465 0.2087626 -0.0687528 -0.0549382 -0.035015 0.0640293 0.0678314 -0.286131 0.0923529 0.2096524 0.403655 -0.0143359 0.065591 0.0161292 0.2693848 0.012032 0.0376509 0.0129108 0.0780094 unknown
polarizability: 159.4502205|-0.8516581|101.3937298|-3.5641181|-1.8799189|54.5399843 unknown
InChI: InChI=1S/C8H11NO2/c1-2-11-8-5-3-7(9-10)4-6-8/h3-6,9-10H,2H2,1H3
charge 0 multiplicity 1
22 atoms
O  2.322239 0.432353 -0.014072
O  -3.98904 -0.997271 -0.195595
N  -3.342475 0.256066 0.255275
C  0.922497 0.288097 0.030336
C  -1.914512 0.2314 0.116294
C  0.183273 1.498076 0.012902
C  0.235769 -0.949068 0.083718
C  -1.22074 1.472135 0.052446
C  -1.177589 -0.973744 0.127462
C  3.133337 -0.797033 -0.006401
C  4.596472 -0.363605 -0.058878
H  0.728072 2.445967 -0.035156
H  0.779425 -1.89855 0.085557
H  -1.778693 2.416663 0.044029
H  -1.711685 -1.927301 0.142717
H  2.919684 -1.377679 0.915591
H  2.86849 -1.422907 -0.884439
H  5.257008 -1.249866 -0.054655
H  4.796466 0.218803 -0.974501
H  4.846846 0.264921 0.812815
H  -3.790615 1.014924 -0.280173
H  -4.405529 -1.341781 0.638129
