program: Gaussian 09
title: 000108165
version: EM64L-G09RevD.01
frameworkgroup: C1[X(C16H19O4P)]
method: RPBEPBE
basis: SDD
operation: Freq
keyword: #p
keyword: freq=noraman
keyword: PBEPBE/SDD
title: #p freq=noraman PBEPBE/SDD
converged: YES YES NO NO
title: Mulliken charges:
elementType: P O O O O C C C C C C C C C C C C C C C C H H H H H H H H H H H H H H H H H H H
charge: 1.334177 -0.522451 -0.529569 -0.533126 -0.606619 0.315792 -0.701951 -0.682597 -0.682866 0.368299 0.369613 -0.339207 -0.337044 -0.365888 -0.364421 -0.201525 -0.199266 -0.193353 -0.192363 -0.247444 -0.246289 0.246687 0.217403 0.246363 0.236299 0.235056 0.203105 0.261339 0.208160 0.229947 0.289368 0.286876 0.258647 0.257904 0.229580 0.229591 0.230899 0.230813 0.229948 0.230112
chargesum: 0.00000
title: Mulliken charges with hydrogens summed into heavy atoms:
elementType: P O O O O C C C C C C C C C C C C C C C C
charge: 1.334177 -0.522451 -0.529569 -0.533126 -0.606619 0.315792 0.008502 -0.008137 0.016581 0.368299 0.369613 -0.049839 -0.050169 -0.107241 -0.106516 0.028055 0.030325 0.037546 0.038450 -0.017496 -0.016177
polarizability: 2.47550914e+02 -3.06902047e+00 1.86937612e+02 -2.83519876e+00 1.33651594e+00 1.91685683e+02
1716.lowfreq: -4.3656 -2.5731 -0.0009 0.0011 0.0015 6.6890 12.9954 18.4123 22.0142
frequency: 11.7679 18.3010 21.8805 28.0327 38.1205 49.0787 97.2860 108.2239 128.5514 160.5643 175.4730 175.8454 203.8776 235.7550 239.6383 246.5149 257.6873 281.3936 292.2519 311.3463 328.4198 378.7687 406.6501 410.0615 411.4716 423.7637 440.1519 471.9952 484.8003 499.2350 539.4095 542.5678 602.4007 608.3437 616.7070 664.9250 687.6448 691.8481 692.3729 763.2772 764.4988 785.0548 831.5773 832.8655 833.4741 837.8571 840.1255 913.4356 915.7977 917.5083 922.4944 957.4244 971.2549 971.9985 985.5849 986.2781 990.2190 990.9572 1019.9331 1020.9773 1027.7551 1028.5452 1032.7019 1076.1410 1077.3015 1151.4875 1157.1809 1168.6257 1169.6802 1174.3553 1183.4048 1191.2606 1259.9361 1271.3252 1310.4258 1311.2641 1377.9234 1379.8121 1381.1119 1381.6161 1402.8063 1440.7461 1441.1112 1444.4718 1463.4037 1465.1987 1469.3662 1471.8246 1472.4881 1478.3745 1496.9233 1593.1491 1595.2018 1603.4180 1604.3202 2986.0675 2988.5885 2995.7533 3081.7864 3086.3422 3095.3416 3098.6978 3102.4806 3107.1556 3131.4142 3131.8588 3141.7265 3142.3774 3156.9729 3157.5593 3166.9508 3167.6098 3177.6703 3177.7493
redmass: 3.9669 5.3682 4.1663 3.7843 3.4921 3.9833 5.3991 6.8583 5.7473 5.0444 1.1832 2.7192 4.4032 1.8996 2.0891 3.6711 1.0722 5.4214 5.3196 4.9455 2.8337 2.9640 3.2590 2.9411 3.0129 3.5025 5.6687 3.9115 4.0156 3.7726 5.6567 5.8185 6.9385 6.5950 6.9633 7.5506 7.3592 2.3696 2.3110 1.5345 1.5461 3.8015 5.3735 6.7977 4.2700 1.4178 1.3873 1.5714 1.4213 1.4123 1.5770 1.2080 1.3728 1.3647 4.9211 5.0593 1.3612 1.4058 2.5640 2.1666 1.5880 4.1183 1.4435 1.5249 1.5456 2.6472 2.0484 1.2309 1.1039 1.4092 1.2362 1.7271 3.0543 3.1349 1.3197 1.3214 1.2306 1.2247 8.9093 9.1282 1.2054 2.2571 2.2566 1.0469 1.0587 1.0536 2.1621 1.3296 1.5482 1.0606 1.0532 6.2379 6.2919 6.6178 6.5278 1.0355 1.0356 1.0357 1.0992 1.0989 1.0999 1.1009 1.1005 1.1007 1.0851 1.0851 1.0897 1.0897 1.0939 1.0938 1.0978 1.0976 1.0991 1.0990
irintensity: 0.4291 0.3029 1.3882 0.0752 0.8834 1.2534 0.1423 3.5454 2.9926 2.9376 0.8256 2.9684 0.0706 3.8384 3.2663 10.3615 0.1918 2.2085 10.9723 3.2495 3.3212 7.1731 23.8390 0.9927 3.9312 9.1579 49.1037 3.6275 31.2494 42.7971 9.9582 7.8590 10.7632 8.7729 10.7977 13.7191 97.3714 34.6559 28.0381 60.5531 103.8632 63.5960 349.5583 420.0620 162.8799 34.9149 61.6011 0.8961 9.7368 21.2047 10.3536 0.7174 0.8715 0.4617 3.4471 0.7548 1.1267 1.6159 24.8456 38.7155 7.6705 54.6253 1.5950 3.1682 15.0694 293.4496 161.2124 46.6087 21.3415 17.0381 54.4293 9.0910 29.1076 21.2423 0.3431 0.0856 31.1875 37.0746 1.6258 0.9977 26.0565 7.3256 9.9595 1.4783 7.2016 2.9757 176.9017 18.2603 40.4978 10.7769 26.8673 58.7610 25.7562 37.1168 21.4004 14.7861 10.3245 21.8616 9.4705 19.9963 22.0157 19.5646 24.9540 28.9026 0.1775 0.1736 14.8457 17.6441 17.5119 14.8315 16.5631 14.8877 8.7243 6.9045
temp: 298.150 k
press: 1.00000 atm
elementType: 15 8 8 8 8 6 6 6 6 6 6 6 6 6 6 6 6 6 6 6 6 1 1 1 1 1 1 1 1 1 1 1 1 1 1 1 1 1 1 1
symmnumber: 1
zpe: 823536.1 jmol-1
zpe.correction: 0.313668 hartree
zpe.thermalcorrener: 0.335384 hartree
zpe.thermalcorrenthalpy: 0.336329 hartree
zpe.thermalcorrgfe: 0.259242 hartree
zpe.sumelectzpe: -1261.665298 hartree
zpe.sumelectthermal: -1261.643582 hartree
zpe.sumelectthermalent: -1261.642637 hartree
zpe.sumelectthermalfe: -1261.719724 hartree
dipole: -0.8273 1.2205 -0.3777
dipole: 1.5221
quadrupole: -115.8916 -119.5974 -127.0946
quadrupole: -2.9451 -0.6901 0.6212
quadrupole: 4.9696 1.2638 -6.2334 -2.9451 -0.6901 0.6212
hfenergy: -1261.978966 hartree
pointgroup: C01 [X(C16H19O4P1)]
dipole: -0.2406347 -0.5258357 0.155528 debye
polarizability: 244.9480794|12.7867885|189.6116964|2.0022147|1.6947362|191.6144332 unknown
InChI: InChI=1S/C16H19O4P/c1-16(2,3)20-21(17,18-14-10-6-4-7-11-14)19-15-12-8-5-9-13-15/h4-13H,1-3H3
charge 0 multiplicity 1
40 atoms
P  0.145176 -0.630076 -0.159674
O  -0.517062 -1.943384 0.693066
O  -0.635849 0.711368 0.607238
O  1.695302 -0.496062 0.594049
O  0.127718 -0.669165 -1.751758
C  -0.467657 -3.383124 0.152752
C  0.965788 -3.712402 -0.303074
C  -0.881201 -4.183446 1.396732
C  -1.49389 -3.497279 -0.989065
C  -1.972965 1.1131 0.296225
C  2.646841 0.515697 0.246005
C  -2.468223 1.145084 -1.026765
C  2.920483 0.866455 -1.094724
C  -2.749267 1.544207 1.391981
C  3.352098 1.087545 1.324671
C  -3.784313 1.614791 -1.240988
C  3.926807 1.826861 -1.346251
C  -4.05699 2.0223 1.155933
C  4.362668 2.035908 1.052406
C  -4.580335 2.055027 -0.158396
C  4.650774 2.410915 -0.281175
H  1.691607 -3.483762 0.495919
H  1.037314 -4.788339 -0.544384
H  1.239077 -3.14373 -1.209973
H  -1.866162 -3.846447 1.761181
H  -0.144373 -4.051421 2.20668
H  -0.9459 -5.25748 1.144356
H  -1.215447 -2.844804 -1.834335
H  -1.535177 -4.541586 -1.349593
H  -2.49872 -3.211564 -0.633006
H  -1.841438 0.814129 -1.861082
H  2.358249 0.405039 -1.912875
H  -2.323043 1.500107 2.398337
H  3.101471 0.787664 2.346265
H  -4.181667 1.643002 -2.261616
H  4.14635 2.112352 -2.380927
H  -4.666341 2.362583 2.00031
H  4.917566 2.485135 1.88325
H  -5.596651 2.42216 -0.336534
H  5.431183 3.151043 -0.487562
