program: Gaussian 09
title: 000108143
version: EM64L-G09RevD.01
frameworkgroup: C1[X(C22H25NO3)]
method: RPBEPBE
basis: SDD
operation: Freq
keyword: #p
keyword: freq=noraman
keyword: PBEPBE/SDD
title: #p freq=noraman PBEPBE/SDD
converged: YES YES NO NO
title: Mulliken charges:
elementType: O O O N C C C C C C C C C C C C C C C C C C C C C C H H H H H H H H H H H H H H H H H H H H H H H H H
charge: -0.259084 -0.441067 -0.243511 -0.479802 0.174940 0.179290 -0.492630 -0.490977 0.370026 0.339969 -0.743505 -0.743694 -0.744894 -0.741688 -0.697652 -0.396797 0.511790 -0.435457 0.122893 0.268906 -0.341642 -0.349646 -0.353451 -0.338512 0.263359 0.111644 0.202080 0.208604 0.201697 0.209369 0.218535 0.229497 0.214175 0.226217 0.202918 0.216752 0.212993 0.224924 0.225098 0.223989 0.211873 0.212868 0.215133 0.229882 0.308597 0.311790 0.281046 0.223207 0.275765 0.276933 0.387249
chargesum: 0.00000
title: Mulliken charges with hydrogens summed into heavy atoms:
elementType: O O O N C C C C C C C C C C C C C C C C C C C C C C
charge: -0.259084 -0.053818 -0.243511 -0.168012 0.174940 0.179290 -0.081946 -0.079911 0.370026 0.339969 -0.081298 -0.097808 -0.081878 -0.092957 -0.482519 -0.166915 0.511790 -0.126860 0.122893 0.268906 -0.060596 -0.126440 -0.077686 -0.061579 0.263359 0.111644
polarizability: 4.53165252e+02 -6.74581744e+00 2.53108227e+02 -7.45875633e+00 -1.05936538e+01 1.49319727e+02
1716.lowfreq: -3.3217 -0.0010 -0.0006 0.0009 5.6969 8.9014 17.5771 23.5961 38.1952
frequency: 17.5284 23.5682 38.1611 49.0596 62.1301 68.2297 80.4105 95.5575 126.2082 143.7557 156.6929 194.8549 198.5447 214.1529 219.3056 232.2935 251.0737 260.4908 265.7633 275.1341 283.7825 290.5004 317.5517 328.4671 350.6524 365.8610 389.2102 395.8511 406.1757 419.3335 445.5873 458.9534 471.1126 474.6184 500.4485 520.3752 529.4392 541.9055 589.3852 591.9774 617.5798 621.0370 629.4886 653.1276 670.9814 677.4024 693.3341 703.0691 756.0137 764.9423 777.0890 785.4145 825.5617 850.0886 858.8036 871.3502 883.0712 888.6523 890.4029 910.1027 926.3338 929.5554 933.7339 958.6585 966.7845 984.9848 988.1857 1001.3245 1001.8559 1010.7623 1021.6203 1024.3425 1055.8933 1061.8199 1082.1728 1094.3801 1114.5638 1120.9393 1151.0291 1153.5484 1182.6448 1190.7536 1195.4927 1197.9642 1219.9082 1238.9000 1242.0394 1252.6617 1264.2693 1292.7843 1302.6739 1312.7727 1323.0708 1343.9068 1345.1473 1362.1048 1373.4130 1375.7814 1379.2090 1389.5485 1394.9343 1397.3134 1409.9728 1453.6528 1460.2344 1463.7883 1466.3437 1471.1277 1476.0311 1478.9327 1483.1691 1487.1368 1488.6236 1493.5157 1498.2627 1507.3712 1562.7427 1585.4322 1601.7438 1616.8023 1621.0538 1645.2174 2970.6865 2971.0813 2973.0276 2973.9014 2976.1699 2981.7592 3024.7680 3035.3701 3063.3194 3064.3183 3068.8018 3069.8036 3075.3439 3076.3506 3079.4677 3080.9285 3103.3873 3124.0481 3137.2861 3155.2540 3173.2834 3178.8004 3199.1279 3527.8848 3533.3809
redmass: 4.9687 5.2210 5.8793 3.0624 5.7945 4.8548 5.7190 5.0341 4.2639 3.8184 6.2074 1.5779 2.5331 1.8615 1.5354 2.3327 1.1122 1.6442 1.9750 2.5087 3.4894 4.1707 2.7006 2.9500 2.4226 2.8522 3.2606 3.0682 2.8416 3.4715 4.5884 2.9394 4.0704 4.5079 2.9872 4.7931 2.8916 3.6764 2.3363 1.4229 2.1716 4.2257 6.1876 1.8584 4.5944 4.2654 5.0917 3.3802 4.3666 3.0759 4.5489 3.0379 2.3412 1.5826 1.4431 3.8643 1.8615 1.8311 1.6682 3.5482 1.5307 1.5124 1.7302 1.8459 1.5016 1.3857 1.3383 4.2297 1.3003 1.4168 1.5034 2.5991 2.6417 1.9348 1.6462 3.4073 1.9596 1.3951 1.6745 1.5262 3.2577 1.6947 2.0547 1.2410 2.9970 1.9532 3.3323 1.7874 1.9144 1.8099 1.4697 2.1247 2.4212 1.4532 1.4790 5.1318 1.1872 1.1933 5.3250 2.1294 1.2833 1.5660 3.8167 1.0668 1.0579 1.0521 1.0665 1.0895 1.0730 1.2426 1.0820 1.0623 1.2446 1.8505 2.0317 2.3047 8.1156 5.5417 5.0345 6.1151 6.3489 8.7471 1.0361 1.0361 1.0476 1.0393 1.0452 1.0576 1.0992 1.1025 1.0994 1.0994 1.0989 1.0984 1.1001 1.0999 1.0990 1.0992 1.0894 1.0899 1.0890 1.0887 1.0963 1.0953 1.0947 1.0758 1.0642
irintensity: 0.4283 0.5825 0.1657 0.0461 0.2912 1.1450 3.7648 0.9037 1.9566 2.1930 0.7015 0.2400 0.1625 0.0854 0.5869 2.1896 0.9465 1.5864 0.2587 8.6301 1.6558 0.5555 0.5385 2.5565 1.7201 0.9604 2.1329 2.8451 0.5959 4.8792 26.2897 1.0978 11.1555 12.3445 0.4925 10.0530 10.5695 7.5738 14.4751 84.5148 25.9335 17.5036 5.5036 18.0001 7.9585 7.4840 15.5880 111.1521 8.6434 0.7035 1.8720 3.1322 4.5665 9.0009 23.9354 21.6929 17.6939 23.2080 27.3464 9.3925 1.4870 0.5135 2.9855 1.0361 0.3148 2.3442 2.7397 196.8064 3.7358 10.7863 9.8700 107.1451 37.3225 9.7205 4.5195 39.9218 6.8471 15.8180 128.8944 3.4015 1.5167 6.1278 1.3648 11.5164 4.8083 2.8683 41.6939 34.6477 2.8896 6.0480 38.4514 22.0205 142.9301 2.8724 14.1867 118.8520 5.8469 34.5677 19.2728 18.7265 2.9955 26.3803 25.6278 0.1513 1.4504 1.1366 1.2392 15.4887 23.5644 8.7035 23.1252 6.2456 74.2269 0.3107 163.3039 279.8320 42.2033 75.4011 114.1049 6.5903 44.5529 363.7304 5.4396 36.2049 28.6605 0.2417 86.4266 66.9295 45.3855 47.3044 2.4848 5.7409 24.8549 158.7747 14.6286 38.1575 55.3414 24.7091 26.3282 16.2403 19.9735 0.2000 1.5718 0.4622 5.2385 8.4617 57.3174
temp: 298.150 k
press: 1.00000 atm
elementType: 8 8 8 7 6 6 6 6 6 6 6 6 6 6 6 6 6 6 6 6 6 6 6 6 6 6 1 1 1 1 1 1 1 1 1 1 1 1 1 1 1 1 1 1 1 1 1 1 1 1 1
symmnumber: 1
zpe: 1100684.6 jmol-1
zpe.correction: 0.419229 hartree
zpe.thermalcorrener: 0.443918 hartree
zpe.thermalcorrenthalpy: 0.444863 hartree
zpe.thermalcorrgfe: 0.364139 hartree
zpe.sumelectzpe: -1131.917812 hartree
zpe.sumelectthermal: -1131.893122 hartree
zpe.sumelectthermalent: -1131.892178 hartree
zpe.sumelectthermalfe: -1131.972902 hartree
dipole: 2.6619 4.5678 -0.2934
dipole: 5.2950
quadrupole: -152.0918 -152.1066 -158.2437
quadrupole: -14.4267 4.0007 -1.7215
quadrupole: 2.0556 2.0408 -4.0963 -14.4267 4.0007 -1.7215
hfenergy: -1132.3370407 hartree
pointgroup: C01 [X(C22H25N1O3)]
dipole: -1.0732833 1.7795467 0.1449332 debye
polarizability: 452.9642623|9.7172125|252.9316861|-6.7166671|12.3738547|149.6972574 unknown
InChI: InChI=1S/C22H25NO3/c1-21(2)11-12-22(3,4)18-13-16(9-10-17(18)21)23-19(24)14-5-7-15(8-6-14)20(25)26/h5-10,13,23,25H,11-12H2,1-4H3
charge 0 multiplicity 1
51 atoms
O  1.425436 -2.432433 0.00773
O  7.29154 2.057516 0.490362
O  8.097636 0.075293 -0.413062
N  0.59727 -0.233039 -0.034756
C  -3.87771 1.917998 -0.160939
C  -5.193249 -0.90007 0.073919
C  -5.348339 1.660645 0.274177
C  -5.939914 0.392954 -0.360761
C  -3.057523 0.610968 -0.057016
C  -3.664546 -0.681392 0.032468
C  -3.838463 2.426955 -1.634623
C  -3.301595 3.030387 0.761484
C  -5.610952 -1.291744 1.525063
C  -5.626483 -2.04193 -0.890655
C  -1.644526 0.694831 -0.085869
C  -2.810611 -1.813006 0.121938
C  -0.81208 -0.446943 -0.007201
C  -1.407897 -1.729099 0.102887
C  1.620792 -1.176735 0.002301
C  3.019886 -0.605685 0.015675
C  4.066689 -1.446622 -0.444751
C  3.335951 0.69218 0.500965
C  5.39633 -0.992195 -0.450884
C  4.667766 1.150329 0.502091
C  5.704005 0.312233 0.017802
C  7.124098 0.753271 -0.005829
H  -5.957204 2.545024 0.000936
H  -5.388919 1.578691 1.378741
H  -7.008781 0.292143 -0.0878
H  -5.904921 0.478875 -1.465002
H  -2.798585 2.612049 -1.960407
H  -4.277351 1.692128 -2.332367
H  -4.402546 3.374533 -1.727566
H  -3.205161 2.673972 1.803257
H  -2.310853 3.387773 0.426809
H  -3.981476 3.903362 0.757598
H  -6.696067 -1.505239 1.566729
H  -5.069345 -2.194649 1.860348
H  -5.388066 -0.484602 2.245668
H  -5.257379 -1.857144 -1.915924
H  -5.256362 -3.030955 -0.567434
H  -6.731184 -2.09875 -0.926001
H  -1.172379 1.683157 -0.164953
H  -3.257305 -2.809988 0.20465
H  -0.77977 -2.618693 0.163331
H  0.883066 0.743461 -0.135166
H  3.806925 -2.454361 -0.782828
H  2.558757 1.340078 0.923921
H  6.211693 -1.62763 -0.810971
H  4.918399 2.144267 0.88206
H  8.257207 2.291936 0.450354
