program: Gaussian 09
title: 000108158
version: EM64L-G09RevD.01
frameworkgroup: C1[X(C11H18ClN3O6S)]
method: RPBEPBE
basis: SDD
operation: Freq
keyword: #p
keyword: freq=noraman
keyword: PBEPBE/SDD
title: #p freq=noraman PBEPBE/SDD
converged: YES YES NO NO
title: Mulliken charges:
elementType: Cl S O O O O O O N N N C C C C C C C C C C C H H H H H H H H H H H H H H H H H H
charge: -0.049965 0.243481 -0.278730 -0.281271 -0.420095 -0.241100 -0.453021 -0.207178 -0.416687 -0.370640 -0.655959 -0.155198 -0.377557 -0.552580 -0.086733 0.244021 -0.699572 0.222824 0.167411 -0.386725 -0.742813 0.183982 0.278860 0.248655 0.236120 0.216715 0.260027 0.205712 0.345920 0.251878 0.343127 0.362363 0.315418 0.280675 0.282638 0.287289 0.300031 0.315306 0.383349 0.400022
chargesum: 0.00000
title: Mulliken charges with hydrogens summed into heavy atoms:
elementType: Cl S O O O O O O N N N C C C C C C C C C C C
charge: -0.049965 0.243481 -0.278730 -0.281271 -0.036746 -0.241100 -0.052999 -0.207178 -0.070767 -0.008277 -0.059866 0.123663 0.107218 -0.075837 0.118979 0.244021 -0.104568 0.222824 0.167411 0.183202 -0.127477 0.183982
polarizability: 2.50495586e+02 1.22850020e+01 1.38534580e+02 1.75629220e+00 6.80995277e+00 1.65228505e+02
1716.lowfreq: -5.4463 -2.6570 -0.0013 0.0009 0.0010 5.9642 11.6541 15.5256 17.4307
frequency: 10.8311 14.8457 17.3196 21.7634 29.9109 38.0416 42.6909 46.9697 59.4545 65.0149 84.3470 92.3749 116.3194 130.1928 155.2961 166.9560 174.4365 186.2119 217.8067 233.5177 234.8504 268.0547 269.0115 300.5628 307.9944 321.7564 337.4358 394.3724 411.6495 443.3162 484.1776 493.8624 506.2990 536.2269 543.1408 556.9425 579.8263 586.4923 591.7601 611.9735 629.8620 645.3644 651.7331 677.1958 683.3923 688.9956 717.5393 760.2374 776.9061 812.6699 819.9262 833.3161 892.7943 912.5109 947.7869 979.0140 980.9323 1008.6093 1033.7186 1050.9081 1059.1719 1077.6541 1091.9862 1116.5036 1127.7058 1142.8081 1148.6504 1171.1408 1193.8427 1214.2155 1222.3152 1223.3168 1229.8783 1244.7908 1259.5577 1267.8825 1282.4888 1294.4212 1305.4288 1319.3922 1330.9141 1340.6903 1353.4425 1378.3203 1396.4302 1443.8516 1452.0183 1457.3882 1458.1694 1469.5854 1498.4744 1591.7587 1599.0519 1617.6899 1664.0659 1690.0806 2817.7907 2955.5041 2979.5682 2997.4525 3010.7771 3031.7420 3037.6165 3060.8209 3083.5166 3086.7557 3107.9107 3190.6624 3458.3798 3506.9533 3518.4140 3535.6792 3543.2115 3665.5056
redmass: 7.1223 10.7303 5.8245 8.2062 7.9324 12.2447 8.9011 8.5747 5.8561 5.5260 7.8260 7.9866 2.9455 4.6306 4.3547 3.2641 3.5413 3.4412 4.0486 3.1212 1.6209 6.0270 4.8421 5.3489 4.7370 3.0984 3.6493 3.5907 1.4867 3.5652 3.0719 2.2260 3.8226 4.1566 4.2135 3.0304 7.4571 3.9972 1.3558 1.8700 3.4824 2.4501 1.5188 7.3765 2.9551 1.4124 2.1451 2.8779 4.4164 1.9948 2.0116 2.5260 2.1011 4.9485 4.0345 2.0352 2.2282 2.5363 2.8810 3.3183 2.7900 2.1387 2.7886 1.9295 1.3304 1.2314 1.1802 1.6013 2.1431 1.0856 1.6629 1.6869 1.1275 1.2672 1.2094 1.5802 1.3381 1.4853 2.0879 1.3231 1.3226 1.5245 1.6683 1.8456 1.0801 1.1021 1.1023 1.2671 1.8199 1.0996 2.2556 8.1336 1.3178 6.8005 3.8672 9.3642 1.0784 1.0814 1.0648 1.0601 1.0604 1.0604 1.0999 1.0964 1.1020 1.0541 1.1043 1.1134 1.0779 1.0638 1.0451 1.0646 1.0783 1.1012
irintensity: 0.3560 0.2079 0.3947 0.4194 1.2558 2.3786 1.2894 2.9402 0.6728 2.5835 10.2463 0.2065 2.6495 6.0312 10.4532 7.1603 5.9673 8.1655 3.1552 11.7110 14.5202 0.9196 5.4059 6.6217 8.9036 25.3365 15.0405 72.2025 136.1136 54.1246 50.3481 33.4394 13.9419 3.6590 53.5066 12.1738 62.7262 39.5685 26.3098 67.2209 1.0403 52.8551 264.8695 43.9028 81.0197 31.1998 35.0066 18.1060 0.6023 2.6188 6.1569 22.9984 27.1154 18.0920 17.1337 0.9821 3.7744 7.5169 0.9151 138.2349 116.1212 225.7553 25.2217 1.5846 2.5876 1.8271 1.4315 17.7007 5.5270 0.2907 9.7585 12.8247 28.5205 0.4114 8.8403 7.5509 31.9017 14.4814 50.8189 6.6841 5.6445 8.1853 19.0548 2.5687 10.9261 31.7937 14.8847 264.2304 448.9775 25.4309 231.7261 191.8850 184.6354 68.9655 173.3911 273.1103 72.2811 22.7851 13.4157 22.7709 11.2582 18.8437 3.0545 2.2200 23.8874 8.5736 1.9794 1.6515 109.2581 24.9788 15.1353 34.2216 84.6759 16.8497
temp: 298.150 k
press: 1.00000 atm
elementType: 17 16 8 8 8 8 8 8 7 7 7 6 6 6 6 6 6 6 6 6 6 6 1 1 1 1 1 1 1 1 1 1 1 1 1 1 1 1 1 1
symmnumber: 1
zpe: 792590.4 jmol-1
zpe.correction: 0.301882 hartree
zpe.thermalcorrener: 0.327644 hartree
zpe.thermalcorrenthalpy: 0.328588 hartree
zpe.thermalcorrgfe: 0.238812 hartree
zpe.sumelectzpe: -1902.006622 hartree
zpe.sumelectthermal: -1901.980860 hartree
zpe.sumelectthermalent: -1901.979915 hartree
zpe.sumelectthermalfe: -1902.069692 hartree
dipole: -3.6025 -2.3284 0.6067
dipole: 4.3322
quadrupole: -144.0248 -151.0106 -141.2109
quadrupole: -15.6466 -15.1461 -3.5702
quadrupole: 1.3906 -5.5952 4.2045 -15.6466 -15.1461 -3.5702
hfenergy: -1902.3085037 hartree
pointgroup: C01 [X(C11H18Cl1N3O6S1)]
dipole: 1.3096539 -1.0899838 -0.041825 debye
polarizability: 246.8355757|-23.2653209|140.6037548|3.9296077|-0.9344046|166.8193405 unknown
InChI: InChI=1S/C11H18ClN3O6S/c12-5-22-4-7(10(19)14-3-9(17)18)15-8(16)2-1-6(13)11(20)21/h6-7,14-15,17,20H,1-5,13H2
charge 0 multiplicity 1
40 atoms
Cl -0.978621 3.364811 -0.656393
S  1.940102 2.265073 -0.180633
O  -1.094154 -0.633898 -2.316448
O  1.923168 -1.157867 1.456258
O  -4.403167 -0.380677 1.959794
O  -6.392202 0.677508 1.428579
O  6.022018 -0.866007 -1.115507
O  7.112473 -1.412087 0.868565
N  -0.054254 -0.649211 -0.247801
N  3.606776 -0.964373 -0.123567
N  -5.997034 0.386888 -1.253528
C  1.280394 -0.515248 -0.834838
C  -3.577259 0.041235 -0.826527
C  -2.504493 -0.952723 -0.322016
C  -5.03629 -0.301012 -0.398614
C  -1.179398 -0.735454 -1.050227
C  1.537194 0.898826 -1.425531
C  2.293854 -0.907445 0.265053
C  -5.366568 0.07177 1.04741
C  4.661087 -1.25282 0.850638
C  0.280971 2.609244 0.553567
C  6.05422 -1.196258 0.2502
H  1.36101 -1.221719 -1.689601
H  -3.55552 0.025657 -1.931929
H  -3.335076 1.076103 -0.524422
H  -2.840679 -1.98569 -0.549368
H  -2.38574 -0.883914 0.772205
H  -5.127155 -1.420456 -0.425656
H  -0.071854 -0.86761 0.756672
H  2.411774 0.89407 -2.099425
H  0.657345 1.21289 -2.009455
H  3.897273 -0.756148 -1.081565
H  -6.878213 0.662306 -0.818264
H  -6.037293 0.091508 -2.226895
H  4.521517 -2.253756 1.302651
H  4.618236 -0.538547 1.695711
H  0.431759 3.353237 1.346935
H  -0.196763 1.695109 0.920409
H  -4.69996 -0.140047 2.879674
H  6.945521 -0.831068 -1.482313
