program: Gaussian 09
title: 000108105
version: EM64L-G09RevD.01
frameworkgroup: C1[X(C12H18N2O5)]
method: RPBEPBE
basis: SDD
operation: Freq
keyword: #p
keyword: freq=noraman
keyword: PBEPBE/SDD
title: #p freq=noraman PBEPBE/SDD
converged: YES YES NO NO
title: Mulliken charges:
elementType: O O O O O N N C C C C C C C C C C C C H H H H H H H H H H H H H H H H H H
charge: -0.447664 -0.221822 -0.274156 -0.414913 -0.234271 -0.423301 -0.595629 -0.191772 -0.571448 0.255325 -0.434578 -0.132151 -0.669057 0.158285 0.244998 -0.535703 -0.402727 -0.156334 0.174041 0.252878 0.239812 0.252538 0.240371 0.263873 0.298200 0.227433 0.228195 0.346741 0.241656 0.221778 0.254877 0.221377 0.240264 0.391310 0.300221 0.273985 0.377368
chargesum: 0.00000
title: Mulliken charges with hydrogens summed into heavy atoms:
elementType: O O O O O N N C C C C C C C C C C C C
charge: -0.056354 -0.221822 -0.274156 -0.037544 -0.234271 -0.076560 -0.021423 0.061106 -0.079099 0.255325 0.069666 0.166049 -0.213428 0.158285 0.244998 -0.072269 0.073527 0.083930 0.174041
polarizability: 1.80240725e+02 1.05113169e+00 1.58708550e+02 3.34923459e+00 1.34861543e+01 1.39108238e+02
1716.lowfreq: -4.9967 -1.7819 -0.0006 -0.0006 -0.0003 7.4378 15.0062 17.8268 33.7695
frequency: 14.8469 17.7286 33.7561 38.9992 47.5763 50.0216 60.0221 78.7434 92.6684 99.4753 136.5434 159.3956 169.1259 195.0288 209.9074 242.7377 281.1332 289.5226 295.0110 331.6401 333.1278 361.9764 385.4953 408.3602 476.9911 503.4901 524.4763 530.3898 561.8949 594.5616 603.3241 611.5063 621.0608 640.7591 652.2238 686.7146 695.6292 713.9674 718.8204 764.7781 799.0086 820.4270 838.2515 894.8757 917.2712 930.6235 938.3491 946.3552 986.1666 990.9463 1028.9683 1030.3734 1047.3402 1052.3402 1057.1181 1085.7187 1098.0064 1113.1518 1119.1504 1127.1250 1148.3128 1151.4981 1179.4656 1205.2271 1217.4907 1233.6540 1257.4051 1262.4121 1280.2529 1300.9728 1310.4314 1320.5863 1324.7439 1352.5332 1361.2799 1398.7048 1420.8479 1438.1758 1447.3855 1459.4988 1468.1008 1472.5648 1605.3477 1613.6183 1672.8338 1676.2582 1800.6327 2981.8187 2992.1336 3002.1789 3011.6822 3015.1631 3039.5174 3066.3470 3067.3755 3069.6064 3082.8066 3083.4495 3166.1958 3185.7569 3473.6933 3500.8846 3526.4571 3549.6974 3610.7044
redmass: 5.5610 6.2386 6.6887 3.7481 5.2363 5.8845 6.7875 5.0437 4.1285 4.6676 4.2315 3.2160 3.6814 3.7274 4.2959 1.3501 4.2846 4.0199 3.3474 3.3069 2.7797 2.0687 4.2614 2.9563 3.3793 2.5348 3.4134 3.3713 1.5958 2.0330 1.8295 1.3934 1.5518 1.9293 1.2056 3.5615 3.4961 2.8958 4.3288 2.6996 3.2662 1.8669 1.4622 2.2305 2.4276 1.3143 2.9338 3.7794 2.4421 1.4979 2.2623 2.4684 1.5679 2.6854 2.6263 2.0051 1.5353 2.0493 1.8130 2.0963 1.6096 2.0258 1.6868 1.2115 1.7086 1.3666 1.4787 1.3412 1.4977 1.3838 1.2872 1.3670 1.5791 1.6253 1.5269 1.7714 1.0812 1.0891 1.1987 1.1027 1.1029 2.0958 6.5972 1.3072 3.7043 9.0299 8.8449 1.0615 1.0605 1.0775 1.0837 1.0649 1.0989 1.1035 1.0650 1.0848 1.0743 1.0823 1.1139 1.1147 1.0448 1.0638 1.0644 1.0782 1.0990
irintensity: 0.5525 0.1294 1.3373 0.3553 1.6746 3.3651 2.2692 4.7910 0.3925 0.2159 3.3896 0.3239 18.0349 1.7688 3.8912 54.8639 0.9714 5.4694 5.4324 0.4271 6.3693 3.0428 7.3407 6.2818 6.5847 32.8128 53.2812 42.8386 200.6084 15.5462 58.8609 188.6667 120.0069 146.3939 3.8933 30.1152 4.7351 40.1983 11.5625 11.9517 7.2958 3.1937 7.1967 15.7662 2.2389 66.0031 25.5492 45.9569 6.5391 21.3153 26.4942 40.5938 13.5077 277.0344 8.5844 94.7000 1.3494 18.6683 25.1722 2.9320 4.2940 10.2044 14.1545 5.4794 35.8438 0.2855 4.8942 20.0575 16.8558 15.9431 9.8828 4.9302 28.6582 17.1220 3.9890 5.3770 9.9995 13.3212 1.6219 19.1920 16.4361 418.0922 123.6460 153.2476 164.3882 178.0284 12.3353 5.4991 14.0556 10.3699 30.3980 11.4298 5.6639 33.9055 4.7582 7.1375 18.0128 12.7768 10.1405 15.0799 8.7250 20.4196 33.0030 54.1787 10.2069
temp: 298.150 k
press: 1.00000 atm
elementType: 8 8 8 8 8 7 7 6 6 6 6 6 6 6 6 6 6 6 6 1 1 1 1 1 1 1 1 1 1 1 1 1 1 1 1 1 1
symmnumber: 1
zpe: 770758.2 jmol-1
zpe.correction: 0.293566 hartree
zpe.thermalcorrener: 0.314810 hartree
zpe.thermalcorrenthalpy: 0.315754 hartree
zpe.thermalcorrgfe: 0.239182 hartree
zpe.sumelectzpe: -952.188377 hartree
zpe.sumelectthermal: -952.167133 hartree
zpe.sumelectthermalent: -952.166189 hartree
zpe.sumelectthermalfe: -952.242762 hartree
dipole: -0.8568 -1.6118 -3.2840
dipole: 3.7572
quadrupole: -132.6525 -108.4855 -111.0616
quadrupole: -4.9679 7.6367 12.1249
quadrupole: -15.2526 8.9144 6.3382 -4.9679 7.6367 12.1249
hfenergy: -952.4819433 hartree
pointgroup: C01 [X(C12H18N2O5)]
dipole: -0.3888612 0.1053736 -1.4222322 debye
polarizability: 180.3496026|-2.179726|142.5233328|3.262789|15.2101156|155.1845783 unknown
InChI: InChI=1S/C12H18N2O5/c1-6-4-7(6)5-9(12(18)19)14-10(15)3-2-8(13)11(16)17/h7-9,14,16,18H,1-5,13H2
charge 0 multiplicity 1
37 atoms
O  -2.433811 -1.368123 -2.220399
O  -4.163927 -1.890703 -0.760647
O  0.357071 -1.374135 1.689616
O  4.341245 -0.57319 -2.146451
O  4.963287 1.470308 -1.239682
N  -0.646147 -0.945223 -0.355639
N  5.289625 0.189016 1.234936
C  -2.669562 1.313046 0.224699
C  -3.998518 1.651778 -0.557033
C  -3.597155 2.393444 0.677498
C  -2.542132 0.015413 1.016808
C  -1.997368 -1.183355 0.171737
C  -3.881189 3.346484 1.579006
C  -2.984155 -1.528018 -0.935803
C  0.465422 -1.089114 0.454713
C  1.820538 -0.911309 -0.23945
C  2.834561 -0.197559 0.682907
C  4.337444 -0.381967 0.274498
C  4.596456 0.28636 -1.071539
H  -1.738524 1.636466 -0.262384
H  -3.910722 2.15051 -1.529802
H  -4.820884 0.928355 -0.493783
H  -3.522512 -0.274469 1.437288
H  -1.841075 0.14659 1.860685
H  -1.949262 -2.05198 0.858419
H  -4.791304 3.953076 1.500093
H  -3.214644 3.550776 2.425737
H  -0.54885 -0.766799 -1.357154
H  2.205157 -1.922883 -0.482726
H  1.705559 -0.381609 -1.202926
H  2.716093 -0.619365 1.699013
H  2.610036 0.88456 0.750546
H  4.524794 -1.46563 0.153458
H  -3.121582 -1.582283 -2.906305
H  5.452603 1.192821 1.111015
H  5.134568 -0.092242 2.205531
H  4.506664 -0.086851 -3.00038
