program: Gaussian 09
title: 000108117
version: EM64L-G09RevD.01
frameworkgroup: C1[X(C17H14INO3)]
method: RPBEPBE
basis: SDD
operation: Freq
keyword: #p
keyword: freq=noraman
keyword: PBEPBE/SDD
title: #p freq=noraman PBEPBE/SDD
converged: YES YES NO NO
title: Mulliken charges:
elementType: I O O O N C C C C C C C C C C C C C C C C C H H H H H H H H H H H H H H
charge: 0.089150 -0.227339 -0.253658 -0.171719 -0.189636 -0.692423 0.318888 0.187519 0.266355 0.211117 -0.572228 -0.384456 0.492606 -0.340196 -0.386568 -0.411072 -0.357556 -0.166794 0.218447 -0.774417 0.282653 -0.748946 0.254546 0.253531 0.310737 0.239810 0.262170 0.243980 0.254606 0.247203 0.261029 0.254063 0.248653 0.257348 0.260437 0.262159
chargesum: 0.00000
title: Mulliken charges with hydrogens summed into heavy atoms:
elementType: I O O O N C C C C C C C C C C C C C C C C C
charge: 0.089150 -0.227339 -0.253658 -0.171719 -0.189636 -0.184346 0.318888 0.187519 0.266355 0.211117 -0.261491 -0.144647 0.492606 -0.078026 -0.142588 -0.156466 -0.357556 0.080409 0.218447 -0.010672 0.282653 0.030998
polarizability: 4.39334554e+02 -4.17408623e+00 2.06970195e+02 8.77699470e+00 2.08604589e+01 1.15542276e+02
1716.lowfreq: -9.0863 -0.0008 -0.0007 -0.0005 1.9248 4.6419 13.7288 26.5119 40.8796
frequency: 13.3287 26.0355 40.8208 53.4730 60.8046 66.9963 81.2822 88.7766 113.4935 145.4538 156.9551 162.4947 167.8340 219.3461 239.5893 242.1774 287.7677 310.6377 334.7211 352.5454 381.7806 391.9519 421.5885 435.6607 487.2527 504.0860 514.8536 532.4297 547.7403 553.6260 559.4888 579.6400 593.7331 651.5736 657.3979 700.5643 709.5036 741.5929 749.8286 755.2582 821.8766 826.6879 838.9124 840.6496 869.8856 901.0769 933.1595 953.9959 955.7558 967.8745 970.5517 991.0704 1002.7978 1014.4506 1032.1007 1038.5049 1052.8657 1108.2028 1133.2564 1134.2557 1143.1921 1155.1789 1180.0706 1204.0070 1214.7706 1246.8317 1281.8949 1301.4336 1330.9329 1365.1626 1377.0547 1378.9972 1383.9477 1409.4017 1425.4726 1444.4082 1449.1017 1451.2509 1453.1508 1454.5096 1464.0854 1479.9125 1571.4363 1584.5443 1602.0223 1606.9978 1625.1794 1715.2271 2988.6530 2999.7308 3007.2807 3033.9165 3090.8021 3101.2206 3136.2999 3136.3892 3138.5671 3139.1311 3155.6713 3170.6087 3177.6455 3198.3823
redmass: 5.5940 5.0926 3.7701 1.6441 2.5573 6.6593 4.8969 4.5059 5.5646 6.9665 6.8134 5.2498 1.0427 5.1441 2.8343 3.6909 5.6186 6.8119 5.9647 3.7521 5.3840 5.4827 2.8079 3.0370 5.1020 4.4919 3.4260 4.8413 3.5033 4.9574 4.2222 3.8810 3.5990 6.7343 6.8876 3.8219 6.0528 5.9115 5.7051 3.3067 1.3789 4.7479 1.6803 5.9748 1.4307 1.3909 3.2481 1.4564 1.3975 2.0666 2.7389 6.4483 2.8654 2.1561 1.6169 1.6305 2.1579 2.4239 1.8347 1.1721 2.5957 1.4665 1.9856 1.5822 2.6368 1.8855 1.4241 2.1794 4.4442 7.0422 3.6432 1.3189 1.2145 3.3576 1.1887 4.0983 1.0698 1.0879 2.6954 1.0609 1.0569 3.4711 7.7336 7.5602 8.0086 7.6025 7.5495 11.4642 1.0611 1.0376 1.0379 1.0994 1.0970 1.0944 1.0952 1.0947 1.0897 1.1025 1.0927 1.0956 1.0939 1.0932
irintensity: 1.3797 0.2004 0.0485 3.3290 2.7086 0.8313 2.8916 0.3955 1.6374 0.6217 0.3171 2.4390 0.2899 0.0833 6.3406 10.0794 6.6684 11.2596 7.2755 1.7619 0.8521 4.7310 9.5550 0.5306 4.0585 5.0706 5.0990 18.4859 0.9177 0.3045 0.9336 23.4220 10.0734 0.4075 1.7924 6.3871 6.9692 27.3365 85.3717 6.3086 87.5258 60.6888 2.2768 3.4359 12.9104 2.4663 12.5411 4.5143 0.5495 41.3651 35.8867 22.7845 9.8154 14.5973 6.8534 9.3615 25.8636 10.7906 75.2656 3.9506 153.9261 13.5139 12.7901 3.7283 18.9407 45.3830 33.4478 17.3125 380.0401 3.2728 96.2872 19.9123 54.1952 34.6298 23.9636 82.2724 16.9052 27.3752 102.9443 13.1836 22.0486 24.9937 11.5799 11.4686 141.5648 21.3776 20.0387 142.3228 7.9376 6.0780 0.2224 4.8952 8.2963 5.2152 8.9621 3.9889 11.5928 4.1091 3.5174 7.9936 8.1533 2.7434
temp: 298.150 k
press: 1.00000 atm
elementType: 53 8 8 8 7 6 6 6 6 6 6 6 6 6 6 6 6 6 6 6 6 6 1 1 1 1 1 1 1 1 1 1 1 1 1 1
symmnumber: 1
zpe: 698598.1 jmol-1
zpe.correction: 0.266082 hartree
zpe.thermalcorrener: 0.286746 hartree
zpe.thermalcorrenthalpy: 0.287690 hartree
zpe.thermalcorrgfe: 0.212655 hartree
zpe.sumelectzpe: -946.579458 hartree
zpe.sumelectthermal: -946.558794 hartree
zpe.sumelectthermalent: -946.557850 hartree
zpe.sumelectthermalfe: -946.632885 hartree
dipole: -4.3393 -3.8841 -0.7343
dipole: 5.8698
quadrupole: -116.1656 -132.9933 -149.8212
quadrupole: 20.7999 3.5951 5.2653
quadrupole: 16.8278 0.0001 -16.8278 20.7999 3.5951 5.2653
hfenergy: -946.84554 hartree
pointgroup: C01 [X(C17H14I1N1O3)]
dipole: -1.6905452 -1.5305743 -0.3640217 debye
polarizability: 438.4800969|-4.1061759|206.3543525|18.960619|22.0133607|117.0125763 unknown
InChI: InChI=1S/C17H14INO3/c1-10(20)19(22-11(2)21)15-4-6-17-13(9-15)7-12-8-14(18)3-5-16(12)17/h3-6,8-9H,7H2,1-2H3
charge 0 multiplicity 1
36 atoms
I  7.440751 0.175378 0.540461
O  -3.88826 -0.675759 -0.474318
O  -2.994182 2.815977 -0.303595
O  -3.973554 -0.710719 1.892978
N  -3.020449 0.49472 -0.367527
C  1.883633 1.638615 0.526928
C  0.686285 0.797891 0.097886
C  1.124753 -0.488145 -0.340023
C  3.058839 0.695911 0.293014
C  2.590641 -0.553368 -0.219031
C  -0.669672 1.151165 0.101941
C  0.178209 -1.433117 -0.79008
C  -1.617413 0.189889 -0.352156
C  4.42908 0.918358 0.513851
C  3.505067 -1.588595 -0.512651
C  -1.188772 -1.090994 -0.801454
C  5.33016 -0.131579 0.213506
C  4.886521 -1.375617 -0.294417
C  -3.667396 1.746787 -0.338209
C  -5.187276 1.71935 -0.35559
C  -4.265879 -1.239557 0.815354
C  -5.02735 -2.5160 0.557718
H  1.970244 2.565344 -0.073024
H  1.810199 1.954076 1.585831
H  -1.00643 2.136857 0.424006
H  0.489418 -2.423322 -1.14014
H  4.791553 1.873473 0.905563
H  3.165119 -2.552988 -0.905594
H  -1.928064 -1.806309 -1.170094
H  5.606491 -2.168132 -0.517032
H  -5.534135 2.757691 -0.460004
H  -5.583392 1.307868 0.590549
H  -5.578997 1.107967 -1.185742
H  -5.837942 -2.617586 1.296438
H  -5.432564 -2.544126 -0.464761
H  -4.342436 -3.374102 0.686917
