program: Gaussian 09
title: 000108071
version: EM64L-G09RevD.01
frameworkgroup: C1[X(C10H4Cl4)]
method: RPBEPBE
basis: SDD
operation: Freq
keyword: #pfreq=noraman
keyword: PBEPBE/SDD
title: #p freq=noraman PBEPBE/SDD
converged: NO NO NO NO
title: Mulliken charges:
elementType: Cl Cl Cl Cl C C C C C C C C C C H H H H
charge: 0.013594 -0.020621 0.012027 -0.034076 0.522374 0.552285 -0.335063 -0.374741 -0.354102 -0.381362 -0.114681 -0.257368 -0.119332 -0.221097 0.289439 0.270434 0.287684 0.264607
chargesum: 0.00000
title: Mulliken charges with hydrogens summed into heavy atoms:
elementType: Cl Cl Cl Cl C C C C C C C C C C
charge: 0.013594 -0.020621 0.012027 -0.034076 0.522374 0.552285 -0.335063 -0.374741 -0.064663 -0.110928 -0.114681 0.030316 -0.119332 0.043509
polarizability: 2.37465933e+02 4.80874100e+00 1.69790784e+02 1.48365672e-03 -5.93252623e-03 5.11041164e+01
1716.lowfreq: 0.0023 0.0026 0.0029 0.7548 7.3288 8.5396 51.9200 83.8392 129.7606
frequency: 51.9158 83.8382 129.7602 136.7520 172.8435 185.0617 202.2431 262.2630 264.4137 305.6441 324.1857 364.8713 415.5682 423.6728 476.2727 511.4753 537.4595 554.4578 606.2765 633.7176 662.2218 726.7368 766.3864 833.2441 849.2371 865.0157 886.3041 895.0614 959.8568 970.7522 1080.4203 1145.3860 1164.6262 1197.0342 1253.8755 1308.2809 1334.5983 1397.0609 1399.9721 1427.6984 1483.1723 1559.8866 1576.5886 1615.3509 3162.0081 3175.2687 3181.5159 3183.1247
redmass: 23.9922 10.4933 6.5076 26.6732 6.0529 24.7828 27.1228 15.3339 6.1599 17.1518 14.8521 8.8894 3.4326 11.1506 7.6321 3.4590 5.9524 8.7886 8.7239 4.0477 7.9533 10.2967 2.8968 1.6460 7.7131 1.4407 6.5916 1.5160 7.3183 1.3344 2.2946 1.7291 1.5892 3.7321 1.5062 2.1100 4.0877 5.1415 7.1527 3.3058 4.1695 9.2545 8.3429 7.4620 1.0879 1.0923 1.0976 1.0934
irintensity: 0.0164 0.6418 0.2744 0.0365 0.3537 0.2205 0.0522 0.7198 1.2887 0.3896 1.4359 1.9925 8.0827 17.6647 9.0907 1.3024 7.4471 25.4725 0.0405 11.8602 1.9137 14.0545 5.4733 40.2355 98.2524 21.0202 2.2510 18.6462 81.9143 0.7219 39.3007 11.8282 9.2812 73.1280 23.7295 47.0651 0.4462 24.3430 0.6083 17.9591 43.9653 16.1864 92.8592 11.7361 0.1880 1.3073 2.1842 3.0144
temp: 298.150 k
press: 1.00000 atm
elementType: 17 17 17 17 6 6 6 6 6 6 6 6 6 6 1 1 1 1
symmnumber: 1
zpe: 279348.2 jmol-1
zpe.correction: 0.106398 hartree
zpe.thermalcorrener: 0.118595 hartree
zpe.thermalcorrenthalpy: 0.119540 hartree
zpe.thermalcorrgfe: 0.066456 hartree
zpe.sumelectzpe: -2222.745084 hartree
zpe.sumelectthermal: -2222.732887 hartree
zpe.sumelectthermalent: -2222.731943 hartree
zpe.sumelectthermalfe: -2222.785026 hartree
dipole: -0.1948 -0.4844 -0.0002
dipole: 0.5221
quadrupole: -114.5529 -101.4396 -110.3580
quadrupole: 4.4131 -0.0005 -0.0004
quadrupole: -5.7694 7.3439 -1.5745 4.4131 -0.0005 -0.0004
hfenergy: -2222.8514823 hartree
pointgroup: C01 [X(C10H4Cl4)]
dipole: 0.101454 -0.1786125 0.0000699 debye
dipolederiv: -0.1529135 -0.1826517 -0.0000103 -0.297891 -0.6152284 -0.0000231 0.0000101 0.000031 -0.0130001 -0.1483888 -0.1978674 -0.0000094 -0.1214211 -0.7421766 -0.000045 -0.0000119 -0.0000906 -0.0406583 -0.8375134 -0.0256217 0.0000348 -0.0845738 -0.0589038 -0.0000042 0.000077 -0.0000056 -0.0196817 -0.9507132 -0.0204104 -0.0000298 -0.1494806 -0.1115308 -0.0000071 -0.000071 -0.0000029 -0.0553635 0.0420331 -0.0690346 0.0000054 -0.1281031 -0.2402984 -0.0000243 0.0000046 0.0000199 0.0729407 0.1692635 -0.1176691 0.0000004 0.0468534 -0.3049845 -0.0000151 -0.0000133 -0.0000493 0.0605647 -0.0440445 0.347596 0.0000254 0.4421333 0.8788832 0.0000344 0.000029 -0.0000841 -0.0832514 0.1712817 0.3029249 0.0000042 0.0902894 1.1682449 0.0000884 0.0000189 0.0001597 -0.0934836 -0.4290754 -0.0243045 -0.000011 0.0938801 -0.0668858 0.0000108 -0.0000165 0.0000169 -0.1033551 -0.0107293 0.0439633 0.0000086 -0.0948088 0.0285749 -0.0000037 -0.0000052 0.0000048 -0.1374429 1.1780213 -0.0022235 -0.000078 0.1166823 -0.0529388 0.0000066 -0.0001159 0.0000647 -0.0441685 -0.369405 -0.1099884 0.0000031 -0.0603447 -0.2063121 -0.0000017 0.0000161 -0.0000343 -0.0481688 1.4304271 0.1429402 0.0000654 0.2213292 0.1239827 0.0000099 0.0001088 0.0000075 -0.0625205 -0.3306794 -0.121886 -0.0000085 -0.0933776 0.0656528 -0.0000015 -0.0000223 -0.0000039 -0.094369 0.0993707 -0.0120484 -0.000003 -0.0556967 0.0483389 -0.0000098 -0.0000069 -0.0000149 0.1685781 0.0784737 -0.056228 -0.000005 -0.0051844 0.0045022 -0.0000019 -0.0000049 -0.000004 0.1603159 0.0715566 0.0304177 0.0000091 0.0218859 0.0497691 -0.0000129 0.0000044 -0.0000195 0.1696862 0.0330347 0.0720914 -0.0000014 0.0578283 0.0313106 0.0000003 -0.0000009 0.0000045 0.1633777 unknown
polarizability: 237.5299368|4.3345649|169.7267801|0.0006768|0.0060777|51.1041164 unknown
InChI: InChI=1S/C10H4Cl4/c11-5-1-2-6-7(3-5)8(12)4-9(13)10(6)14/h1-4H
charge 0 multiplicity 1
18 atoms
Cl -2.114614 -2.678751 -0.000219
Cl 0.026091 3.406761 0.000131
Cl -4.168732 -0.152152 0.000051
Cl 4.509617 0.07474 0.00006
C  -0.066834 -0.752453 -0.00017
C  0.43043 0.61526 -0.000096
C  -1.487267 -0.97858 -0.00023
C  -0.535926 1.676925 -0.000038
C  1.841577 0.852002 -0.000034
C  0.8860 -1.823981 -0.000135
C  -2.378264 0.094292 -0.000099
C  -1.904321 1.438785 0.000025
C  2.718144 -0.226761 -0.000056
C  2.258094 -1.574945 -0.00009
H  2.212257 1.88012 0.000055
H  0.520611 -2.854309 -0.000158
H  -2.621045 2.263413 0.000178
H  2.977081 -2.398965 -0.000074
