program: Gaussian 09
title: 000108054
version: EM64L-G09RevD.01
frameworkgroup: C*V[C*(CS)]
method: RPBEPBE
basis: SDD
operation: Freq
keyword: #p
keyword: freq=noraman
keyword: PBEPBE/SDD
title: #p freq=noraman PBEPBE/SDD
converged: NO NO NO YES
title: Mulliken charges:
elementType: S C
charge: 0.224094 -0.224094
chargesum: 0.00000
title: Mulliken charges with hydrogens summed into heavy atoms:
polarizability: 1.13457978e+01 1.72770774e-11 1.13457978e+01 2.69997604e-10 2.53302799e-10 3.56342754e+01
1716.lowfreq: 0.0036 0.0063 0.0063 38.9629 38.9629 1124.8416
frequency: 1124.8416
redmass: 14.4661
irintensity: 66.2584
temp: 298.150 k
press: 1.00000 atm
elementType: 16 6
symmnumber: 1
zpe: 6728.0 jmol-1
zpe.correction: 0.002563 hartree
zpe.thermalcorrener: 0.004946 hartree
zpe.thermalcorrenthalpy: 0.005890 hartree
zpe.thermalcorrgfe: -0.018103 hartree
zpe.sumelectzpe: -435.936921 hartree
zpe.sumelectthermal: -435.934538 hartree
zpe.sumelectthermalent: -435.933594 hartree
zpe.sumelectthermalfe: -435.957587 hartree
dipole: 0.0000 0.0000 1.3932
dipole: 1.3932
quadrupole: -18.1059 -18.1059 -21.7254
quadrupole: 0.0000 0.0000 0.0000
quadrupole: 1.2065 1.2065 -2.4130 0.0000 0.0000 0.0000
hfenergy: -435.9394835 hartree
pointgroup: C*V [C*(C1S1)]
dipole: 0.5481192 0. 0. debye
dipolederiv: -0.7700736 0. 0. 0. 0.1801183 0. 0. 0. 0.1801183 0.7700736 0. 0. 0. -0.1801183 0. 0. 0. -0.1801183 unknown
polarizability: 35.6342754|0.|11.3457978|0.|0.|11.3457978 unknown
InChI: InChI=1S/CS/c1-2
charge 0 multiplicity 1
2 atoms
S  0.805295 0.0000 0.0000
C  -0.805295 0.0000 0.0000
