program: Gaussian 09
title: 000008832
version: EM64L-G09RevD.01
frameworkgroup: C1[X(C5H12N2O3)]
method: RPBEPBE
basis: SDD
operation: Freq
keyword: #p
keyword: freq=noraman
keyword: PBEPBE/SDD
title: #p freq=noraman PBEPBE/SDD
converged: YES YES NO NO
title: Mulliken charges:
elementType: O O O N N C C C C C H H H H H H H H H H H H
charge: -0.271791 -0.271782 -0.299851 -0.396291 -0.396286 -0.243036 -0.243084 0.331488 -0.501449 -0.501447 0.199370 0.247917 0.247886 0.199393 0.302542 0.302539 0.197324 0.237655 0.211963 0.211975 0.237649 0.197317
chargesum: 0.00000
title: Mulliken charges with hydrogens summed into heavy atoms:
elementType: O O O N N C C C C C
charge: -0.271791 -0.271782 -0.299851 -0.093749 -0.093746 0.204250 0.204195 0.331488 0.145493 0.145494
polarizability: 1.14494132e+02 -5.16730955e-04 6.56469079e+01 1.64179363e-03 3.07133103e+00 6.99378507e+01
1716.lowfreq: 0.0001 0.0010 0.0011 2.9421 10.8176 14.8120 34.8392 49.6877 60.3933
frequency: 34.5778 49.6872 60.2987 71.8085 109.4734 109.7095 199.2439 211.3351 247.2689 270.5246 283.1490 323.6846 330.8745 399.7396 513.7932 565.9083 617.8765 666.2881 719.5486 859.9406 871.6608 906.1221 1021.9561 1031.2434 1057.4861 1089.2037 1101.7302 1117.4143 1120.2323 1147.3644 1157.2183 1229.8798 1231.0355 1244.5461 1244.5886 1381.1579 1386.5969 1435.4914 1436.7177 1458.2586 1458.3898 1460.9542 1463.3376 1476.3401 1478.5499 1486.8229 1509.5481 1658.2206 2924.2143 2924.4381 2938.9047 2940.2302 2999.9556 3000.1343 3029.3589 3029.9210 3107.5288 3107.6010 3550.5673 3557.6798
redmass: 3.5968 2.9517 4.3900 2.7402 3.4653 2.9704 1.4897 1.2523 1.9990 1.9350 2.8820 3.8576 2.7798 1.8417 4.0297 1.4834 2.5406 3.9509 11.2562 4.8584 5.3627 3.0647 8.7959 8.9907 1.6421 1.6885 3.0017 1.3435 1.4122 1.4640 1.5332 1.2933 2.6782 1.4454 1.2977 1.1958 1.1924 1.1447 1.1561 1.0551 1.0515 1.1152 1.0764 1.1488 1.0685 1.3694 2.0635 5.1426 1.0368 1.0371 1.0618 1.0618 1.1014 1.1014 1.0997 1.0996 1.0971 1.0971 1.0775 1.0765
irintensity: 1.4698 3.0341 9.9608 0.8580 3.8494 20.9747 1.9260 0.0921 6.7755 7.5674 5.9631 13.0899 10.7137 13.6291 24.7498 195.9879 68.3213 0.0079 15.0286 74.2516 8.8482 51.6895 332.6360 92.9676 8.1155 0.1089 67.7987 9.3208 0.5272 15.3164 17.1777 47.5914 6.6845 243.9767 108.4092 12.1999 15.7511 0.5346 0.0184 26.0020 12.7983 24.5533 8.4633 34.2587 7.5027 14.5104 580.3728 172.7098 110.7930 24.8588 128.0134 106.5465 24.3442 128.8362 0.6625 15.8425 1.9689 53.7586 4.9358 21.7467
temp: 298.150 k
press: 1.00000 atm
elementType: 8 8 8 7 7 6 6 6 6 6 1 1 1 1 1 1 1 1 1 1 1 1
symmnumber: 1
zpe: 475021.1 jmol-1
zpe.correction: 0.180926 hartree
zpe.thermalcorrener: 0.193396 hartree
zpe.thermalcorrenthalpy: 0.194340 hartree
zpe.thermalcorrgfe: 0.140612 hartree
zpe.sumelectzpe: -532.052915 hartree
zpe.sumelectthermal: -532.040446 hartree
zpe.sumelectthermalent: -532.039501 hartree
zpe.sumelectthermalfe: -532.093229 hartree
dipole: -0.0011 -2.0767 -1.8642
dipole: 2.7906
quadrupole: -38.9614 -60.2787 -61.9931
quadrupole: 0.0000 0.0002 5.3044
quadrupole: 14.7830 -6.5343 -8.2487 0.0000 0.0002 5.3044
hfenergy: -532.2338413 hartree
pointgroup: C01 [X(C5H12N2O3)]
dipole: -0.0014821 0.8819254 -0.6539321 debye
dipolederiv: -0.9515415 0.2288839 0.0005805 0.546438 -0.7257871 0.0286962 0.0859065 -0.0643562 -0.4124065 -0.9497213 -0.2296401 0.0008596 -0.5469864 -0.7278402 0.0303059 -0.0840986 -0.0638703 -0.4121973 -0.7823147 -0.0002314 -0.0004116 -0.0001599 -0.4148926 0.1827464 -0.000326 0.1472172 -0.9700405 -1.6692762 0.0693912 0.2481595 -0.0979902 -0.6269622 0.0377389 0.2376669 -0.006713 -0.3456691 -1.6704412 -0.0718719 -0.2448408 0.0959549 -0.6270292 0.0370244 -0.2344053 -0.0070586 -0.344454 1.2405894 -0.1989896 -0.1011857 -0.5552618 0.9035776 0.0645413 0.0914217 0.14746 0.3025939 1.2388028 0.2002706 0.0986443 0.5561955 0.9056104 0.0631355 -0.0941829 0.1466757 0.3024523 2.4745816 0.0020423 -0.0012055 0.0018413 0.3931514 -0.3336478 -0.0012421 -0.2374982 1.2905874 0.6570713 -0.1297313 0.0412129 -0.0524628 0.3152983 -0.0888935 0.1586457 -0.1400788 0.3105865 0.655958 0.1302385 -0.0419975 0.053112 0.31576 -0.0891752 -0.1593319 -0.1408697 0.3111951 -0.1912913 -0.1296783 0.020724 -0.0258756 -0.16427 -0.012925 0.091188 0.0119368 0.0577984 0.1278087 0.013501 0.0228543 0.063852 0.0200515 0.0299477 -0.0126111 -0.0421718 -0.0780906 0.1279479 -0.0133615 -0.0234073 -0.0635912 0.0198424 0.0300287 0.0122335 -0.0421837 -0.0780947 -0.1918057 0.1296013 -0.0201341 0.0257417 -0.1639229 -0.0129064 -0.090648 0.0115041 0.058096 0.1143615 0.0204819 -0.0268414 -0.0159991 0.3683846 0.0269506 -0.0490222 0.0663256 0.0947783 0.1145177 -0.0208927 0.0267477 0.0154682 0.368373 0.0269561 0.0487998 0.0665073 0.0945762 -0.1882105 -0.0649297 0.0048541 -0.1980013 -0.072474 0.039169 -0.0240091 0.0597318 0.0623848 0.0269448 0.0685127 0.0137833 0.1088986 -0.0713505 -0.0917887 0.0280282 -0.103824 0.0485825 -0.0113052 0.0296521 0.0381934 0.0110868 0.0640845 0.0425677 -0.075354 0.1175471 -0.2018091 -0.0110613 -0.0295077 -0.0388973 -0.0111471 0.0639872 0.0424572 0.0744325 0.1177959 -0.2019084 0.0272869 -0.0685518 -0.013481 -0.1089198 -0.0718565 -0.0915033 -0.0276669 -0.1036813 0.0487233 -0.1889018 0.0648106 -0.0042116 0.1978062 -0.0717358 0.0385743 0.0245752 0.0596042 0.0623157 unknown
polarizability: 114.4939942|0.0515476|66.2553859|-0.057488|-3.4167319|69.3295109 unknown
InChI: InChI=1S/C5H12N2O3/c1-9-3-6-5(8)7-4-10-2/h6-7H,3-4H2,1-2H3
charge 0 multiplicity 1
22 atoms
O  2.937642 -0.594027 -0.58202
O  -2.932875 -0.600898 -0.574445
O  0.003654 0.315834 1.466988
N  1.177186 0.982175 -0.452389
N  -1.175965 0.979714 -0.449517
C  2.467254 0.637971 0.082789
C  -2.463947 0.632558 0.088737
C  0.001777 0.710059 0.265069
C  4.216363 -1.046471 -0.03272
C  -4.208664 -1.056801 -0.02121
H  3.201899 1.450664 -0.108686
H  2.346624 0.478259 1.171993
H  -2.340479 0.4736 1.177733
H  -3.200982 1.44338 -0.101434
H  1.127557 1.212574 -1.445817
H  -1.129214 1.210325 -1.443036
H  5.017046 -0.28634 -0.166922
H  4.483292 -1.956487 -0.591757
H  4.131794 -1.289956 1.047385
H  -4.120113 -1.299956 1.05865
H  -4.474806 -1.96759 -0.579364
H  -5.011843 -0.298888 -0.153026
