program: Gaussian 09
title: 000108029
version: EM64L-G09RevD.01
frameworkgroup: C1[X(C14H16N2O)]
method: RPBEPBE
basis: SDD
operation: Freq
keyword: #p
keyword: freq=noraman
keyword: PBEPBE/SDD
title: #p freq=noraman PBEPBE/SDD
converged: YES YES NO NO
title: Mulliken charges:
elementType: O N N C C C C C C C C C C C C C C H H H H H H H H H H H H H H H H
charge: -0.270372 -0.305987 -0.407420 0.326073 -0.462824 0.204907 -0.451798 0.163634 -0.372517 -0.446926 0.198441 -0.397544 -0.508264 -0.337667 0.290934 -0.345856 -0.538904 0.220327 0.203524 0.212802 0.187088 0.205333 0.185382 0.224644 0.266341 0.260965 0.302972 0.238713 0.228928 0.247597 0.241451 0.218788 0.217239
chargesum: 0.00000
title: Mulliken charges with hydrogens summed into heavy atoms:
elementType: O N N C C C C C C C C C C C C C C
charge: -0.270372 -0.039646 -0.104448 0.326073 -0.038973 0.204907 -0.051909 0.163634 -0.167184 -0.036901 0.198441 -0.136579 -0.269551 -0.108739 0.290934 -0.098260 0.138574
polarizability: 2.27168996e+02 -1.33888217e+00 2.03797834e+02 7.06746987e-01 -3.45873186e+00 9.03211134e+01
1716.lowfreq: -0.0005 0.0003 0.0004 1.9020 4.1597 8.0154 35.3503 60.2199 85.7927
frequency: 35.2367 60.2084 85.7921 93.7929 142.1276 152.7477 194.0550 221.4642 244.6070 252.7849 285.7452 309.5634 327.3974 372.8954 394.5987 426.2257 463.4873 479.9328 497.1219 505.5290 526.2847 554.4862 595.5218 600.7179 654.2614 661.8008 739.9018 748.1929 770.7719 791.0136 798.4282 803.3874 817.6807 846.0817 860.7005 902.9792 928.5701 934.2466 950.1106 963.0354 994.7798 997.2293 1064.2834 1072.8066 1091.5373 1113.0515 1118.5473 1137.7082 1155.2265 1178.0906 1187.9216 1193.4761 1204.3413 1234.0842 1242.7349 1271.3607 1282.7098 1299.2224 1313.7234 1321.1615 1356.7402 1385.3664 1397.8727 1424.2115 1438.5425 1445.2652 1450.0963 1459.6396 1463.9162 1466.1423 1475.6026 1477.4638 1477.7497 1535.5715 1590.0351 1631.9206 1666.2790 2803.8624 2855.4208 2950.6201 2968.3854 2979.4784 3023.8723 3034.6893 3034.7425 3118.1034 3135.9496 3144.4340 3171.6175 3182.4164 3226.3696 3469.1047 3616.2558
redmass: 3.2263 3.6027 4.3035 3.4321 2.8060 3.8758 3.3461 2.6079 1.2639 4.0549 2.5931 2.7143 4.5628 4.2397 5.5734 2.8154 2.3082 2.1451 2.4731 1.8824 3.4486 3.5812 2.5514 4.1299 2.9706 3.0168 5.6706 3.1207 1.6733 1.9531 3.2678 1.5316 1.4864 1.7200 3.9278 4.6242 2.7012 1.3275 2.4062 2.4225 1.9557 4.3481 2.2058 1.9443 1.7878 1.2628 1.7567 1.2190 1.3764 1.3161 2.0350 2.6827 1.1468 1.2767 1.6768 2.5986 1.7651 1.9157 1.8072 1.3517 2.3488 1.4917 5.6993 1.7168 1.6783 1.3198 1.1305 2.7823 1.0528 1.0878 2.0412 1.1769 1.4266 5.1138 6.4423 7.1539 6.9294 1.0722 1.0715 1.0332 1.0594 1.0838 1.0989 1.1002 1.0937 1.0988 1.0894 1.0899 1.0955 1.0900 1.0973 1.0753 1.0809
irintensity: 0.1903 0.7075 0.3505 9.6763 5.0496 0.0858 3.9614 0.4119 1.4058 0.8353 1.0254 6.4008 4.4465 2.2648 6.4018 4.4112 42.2023 23.9435 37.9421 76.8399 15.3810 7.4883 14.1862 31.1456 13.5314 24.3640 8.6814 1.2280 22.4684 61.3548 22.5792 25.6999 7.4860 32.4214 6.5383 24.1694 0.6390 0.0209 1.4280 25.9760 1.0661 41.3131 0.9353 2.3024 4.4699 0.2306 58.9341 1.5394 0.2781 7.4812 11.5582 129.2976 0.5787 12.4580 8.3205 35.0272 12.0376 21.4879 12.3173 12.4056 2.7880 10.2500 48.0571 15.5239 22.8937 9.6305 0.6291 45.0475 13.4506 2.4371 89.2207 22.6976 6.8489 17.0971 30.9364 37.3398 6.0714 110.2754 123.3978 52.3704 30.4204 44.0713 34.2794 54.2008 61.3767 31.5097 13.1661 20.2036 10.1532 7.7943 1.3777 2.0682 75.4100
temp: 298.150 k
press: 1.00000 atm
elementType: 8 7 7 6 6 6 6 6 6 6 6 6 6 6 6 6 6 1 1 1 1 1 1 1 1 1 1 1 1 1 1 1 1
symmnumber: 1
zpe: 713723.3 jmol-1
zpe.correction: 0.271843 hartree
zpe.thermalcorrener: 0.286770 hartree
zpe.thermalcorrenthalpy: 0.287714 hartree
zpe.thermalcorrgfe: 0.229721 hartree
zpe.sumelectzpe: -726.549112 hartree
zpe.sumelectthermal: -726.534185 hartree
zpe.sumelectthermalent: -726.533241 hartree
zpe.sumelectthermalfe: -726.591234 hartree
dipole: -1.4704 -0.7830 0.8636
dipole: 1.8764
quadrupole: -99.1600 -73.4900 -106.9844
quadrupole: -5.3952 -4.5837 0.3617
quadrupole: -5.9486 19.7215 -13.7729 -5.3952 -4.5837 0.3617
hfenergy: -726.8209546 hartree
pointgroup: C01 [X(C14H16N2O1)]
dipole: -0.5592827 -0.3246636 0.3560716 debye
polarizability: 227.2380191|-0.3737958|203.4846158|-1.1060585|-6.2376161|90.5653082 unknown
InChI: InChI=1S/C14H16N2O/c1-17-11-2-3-14-12(8-11)13(9-16-14)10-4-6-15-7-5-10/h2-4,8-9,15-16H,5-7H2,1H3
charge 0 multiplicity 1
33 atoms
O  3.483957 2.132678 0.076626
N  -4.459335 0.984015 -0.248139
N  0.80934 -2.76539 -0.043287
C  -1.881156 -0.212504 -0.00767
C  -3.13101 -0.961138 0.460381
C  -0.611523 -0.961329 -0.01333
C  -4.264071 0.011051 0.844787
C  0.770083 -0.476106 -0.027426
C  -1.991695 1.087648 -0.420099
C  -3.292636 1.861805 -0.462379
C  1.629199 -1.628626 -0.052233
C  -0.527088 -2.364453 -0.009821
C  1.364455 0.817644 0.023529
C  3.038263 -1.526716 -0.056645
C  2.771183 0.915126 0.024358
C  3.604614 -0.243258 -0.025721
C  2.698069 3.363254 0.134033
H  -3.489274 -1.628143 -0.349561
H  -2.88243 -1.599983 1.330838
H  -5.207037 -0.545759 0.996667
H  -4.000595 0.499348 1.817533
H  -1.114882 1.62725 -0.794038
H  -3.226177 2.694051 0.290401
H  -3.391742 2.35031 -1.453218
H  -5.340069 1.506095 -0.173054
H  -1.329796 -3.099278 -0.011193
H  1.136795 -3.728022 -0.061041
H  0.740666 1.711075 0.089287
H  3.678921 -2.415123 -0.079299
H  4.688955 -0.098972 -0.0282
H  3.436857 4.177929 0.168868
H  2.06355 3.396897 1.042115
H  2.059508 3.477723 -0.764668
