program: Gaussian 09
title: 000108130
version: EM64L-G09RevD.01
frameworkgroup: C1[X(C23H28O6)]
method: RPBEPBE
basis: SDD
operation: Freq
keyword: #pfreq=noraman
keyword: PBEPBE/SDD
title: #p freq=noraman PBEPBE/SDD
converged: YES YES NO NO
title: Mulliken charges:
elementType: O O O O O O C C C C C C C C C C C C C C C C C C C C C C C H H H H H H H H H H H H H H H H H H H H H H H H H H H H
charge: -0.266795 -0.280616 -0.270262 -0.320238 -0.278040 -0.300571 -0.007233 -0.013621 -0.663394 -0.655021 0.482660 0.481489 -0.014104 0.072809 -0.771223 -0.769766 -0.612193 0.168598 -0.634112 0.112209 0.199575 -0.004042 0.216768 0.035665 -0.202718 -0.528250 -0.531662 -0.500108 -0.522809 0.208781 0.209448 0.204647 0.237892 0.206841 0.238433 0.213535 0.217748 0.218911 0.216145 0.217181 0.217151 0.263715 0.262794 0.224316 0.240436 0.249490 0.231415 0.226240 0.244488 0.221370 0.229925 0.202724 0.250588 0.226722 0.208211 0.263818 0.224038
chargesum: 0.00000
title: Mulliken charges with hydrogens summed into heavy atoms:
elementType: O O O O O O C C C C C C C C C C C C C C C C C C C C C C C
charge: -0.266795 -0.280616 -0.270262 -0.320238 -0.278040 -0.300571 0.201548 0.195827 -0.220855 -0.209747 0.482660 0.481489 -0.014104 0.072809 -0.121029 -0.119288 -0.348477 0.168598 -0.371318 0.112209 0.199575 -0.004042 0.216768 0.035665 0.262034 0.178894 0.164121 0.179926 0.173258
polarizability: 3.52332201e+02 2.42819607e+00 2.99777505e+02 -1.16958925e+01 6.77234993e-01 1.93129556e+02
1716.lowfreq: -10.3067 -0.0007 -0.0004 -0.0002 5.2934 8.3465 30.1546 36.0537 43.1993
frequency: 30.0804 35.9389 43.1730 51.7678 60.9625 61.8521 71.8632 86.1349 96.9167 102.5909 120.9500 130.0157 136.4046 150.0233 157.2487 169.0799 179.8545 182.2007 188.4672 191.5612 210.2201 212.5524 220.9740 234.3877 236.6666 258.9632 269.4710 282.0633 288.3819 303.8883 320.6171 335.2278 341.1707 352.2357 361.2616 372.3725 378.6316 416.7835 418.9141 459.2753 478.7665 494.6111 503.7608 525.5182 542.8454 559.4120 583.4704 614.5166 625.2655 649.1886 658.1087 685.4189 690.4552 716.3296 746.6245 771.7361 782.0741 793.1571 826.9497 837.6907 854.4398 867.5368 876.3036 886.7608 899.8000 904.4096 908.1164 923.2976 936.7097 949.6741 972.7360 980.0055 997.4818 1017.8050 1037.7111 1049.4654 1071.5215 1078.2493 1084.1605 1095.7033 1108.7645 1110.9617 1113.2112 1113.5951 1116.1998 1122.1101 1133.0979 1136.1938 1152.1403 1156.3833 1157.8594 1165.1706 1180.2960 1193.1410 1198.8722 1219.9378 1257.3464 1275.8854 1281.8419 1287.9130 1292.4239 1312.4241 1315.2521 1326.2265 1345.3530 1357.9103 1360.0068 1376.0400 1381.3904 1391.0905 1393.4621 1408.1232 1421.5938 1432.2564 1438.9662 1441.8218 1450.0071 1452.8468 1456.1085 1461.0359 1464.0847 1465.8309 1466.8938 1472.6555 1473.6256 1474.6447 1476.9072 1480.4539 1481.7547 1483.0785 1486.6182 1486.7004 1492.1587 1554.6419 1602.1909 1605.4272 1617.3012 2945.6554 2963.5094 2963.9557 2965.7612 2970.7140 2972.5468 2973.7106 2981.1339 2982.8908 2983.9469 2987.0914 3042.0550 3044.7320 3059.7044 3061.9494 3062.0973 3069.7789 3075.8625 3083.9007 3084.9272 3086.2130 3110.6737 3115.2967 3117.1846 3122.9441 3123.0999 3146.2534 3165.8592
redmass: 3.6905 3.9706 3.5508 3.4260 4.0613 3.6176 3.0810 2.5605 3.8744 3.2407 2.4245 2.7732 2.5765 1.9091 1.7952 1.8399 1.8767 1.5029 1.0835 1.6808 4.6552 1.1285 2.6662 4.7326 2.8718 4.6125 3.8481 3.9271 3.5545 4.6167 2.7774 4.2834 4.1158 2.6171 5.1440 4.0624 2.3244 4.2600 4.2867 3.5527 4.3840 5.8966 5.4285 6.9526 3.7712 4.4417 4.8412 5.7659 4.3939 5.5316 6.5937 5.8306 9.2642 6.6198 5.5543 2.9982 6.1655 4.1283 5.5046 4.5194 1.9680 1.9049 4.3107 1.6347 1.8312 2.2643 4.0210 4.9911 2.6234 3.1332 1.3389 6.2320 5.6399 5.4801 4.3605 4.1746 4.1147 1.5458 2.6135 1.9240 1.3095 1.3519 1.5435 1.2481 1.5177 2.4885 1.8319 1.0816 1.3764 1.4397 1.5662 1.5367 1.4082 1.5779 1.8017 2.0365 2.1938 1.2215 1.3936 2.6991 1.6275 2.4567 1.7431 1.4537 1.8065 3.9075 1.3358 3.7379 1.2156 4.3302 1.1968 1.9088 1.4153 1.3522 1.2727 1.8584 2.6177 1.0714 1.1118 1.0539 1.0576 1.0747 1.0575 1.0564 1.0719 1.0742 1.0772 1.1479 1.1377 2.8568 1.0607 1.0618 1.0609 8.3162 8.0613 8.9688 9.7204 1.0811 1.0838 1.0333 1.0306 1.0377 1.0384 1.0354 1.0608 1.0590 1.0354 1.0611 1.0995 1.1004 1.0990 1.1023 1.1004 1.0987 1.0989 1.0958 1.0961 1.1048 1.1023 1.1061 1.1040 1.1054 1.1030 1.0910 1.0927
irintensity: 1.5604 0.0685 1.9983 4.4070 0.0026 0.2680 3.6698 7.5330 1.5100 3.0035 7.8589 2.5298 7.0712 0.1245 0.6472 2.4551 0.3446 1.5027 0.1371 0.1959 1.2128 0.1771 4.7725 3.0890 11.0377 4.9422 5.1822 0.6612 2.3341 11.7213 0.8725 2.6579 2.6798 0.6722 0.0031 1.5527 1.2251 2.5696 0.2470 1.3341 0.4452 4.0261 4.1549 10.1691 5.7855 0.9523 6.5277 2.0523 5.4904 8.1749 3.7814 16.7130 1.9301 2.3628 3.0576 5.4930 29.0309 1.3984 5.2511 29.1800 26.6026 17.2669 8.0641 9.6658 0.6820 4.8640 13.2631 7.2162 13.5557 11.2620 13.9150 169.3221 167.0485 58.7169 24.7104 62.9879 86.3690 23.5885 32.0536 17.4380 9.8494 11.5179 3.9328 1.9484 1.2406 11.4308 9.9752 3.4828 2.6873 14.5661 20.8234 16.4197 3.3114 45.8939 41.2295 16.1139 29.4867 8.1626 20.2502 101.5806 28.1214 43.1074 31.6233 8.4696 9.0598 33.4110 13.8779 48.5988 20.9948 90.6165 13.5871 22.5220 38.7781 18.8524 9.2996 87.5465 116.4775 29.3059 10.8071 3.9021 11.2119 1.9638 3.4532 20.5185 31.9285 1.7344 19.4743 7.4829 2.3049 26.4611 6.4018 35.4173 12.3219 37.6249 98.7764 29.8187 30.0933 0.0847 24.1001 93.5837 35.1345 31.3227 47.1952 95.0085 102.8206 66.3372 97.2874 36.2169 12.4872 7.5532 7.3983 10.4418 108.3764 29.0693 35.5024 48.5010 52.3558 24.5880 25.6740 31.3368 21.3159 22.1174 19.1463 5.5658 3.3233
temp: 298.150 k
press: 1.00000 atm
elementType: 8 8 8 8 8 8 6 6 6 6 6 6 6 6 6 6 6 6 6 6 6 6 6 6 6 6 6 6 6 1 1 1 1 1 1 1 1 1 1 1 1 1 1 1 1 1 1 1 1 1 1 1 1 1 1 1 1
symmnumber: 1
zpe: 1215062.6 jmol-1
zpe.correction: 0.462793 hartree
zpe.thermalcorrener: 0.492490 hartree
zpe.thermalcorrenthalpy: 0.493435 hartree
zpe.thermalcorrgfe: 0.403130 hartree
zpe.sumelectzpe: -1342.316560 hartree
zpe.sumelectthermal: -1342.286862 hartree
zpe.sumelectthermalent: -1342.285918 hartree
zpe.sumelectthermalfe: -1342.376223 hartree
dipole: -0.0819 -2.6421 1.2300
dipole: 2.9155
quadrupole: -159.9572 -152.6790 -170.6063
quadrupole: -3.1216 -3.6903 -1.5959
quadrupole: 1.1236 8.4018 -9.5255 -3.1216 -3.6903 -1.5959
hfenergy: -1342.7793528 hartree
pointgroup: C01 [X(C23H28O6)]
dipole: -0.087544 1.0764522 -0.386396 debye
polarizability: 353.0598207|-0.9791395|298.6117548|6.0083954|10.6552721|193.5676859 unknown
InChI: InChI=1S/C23H28O6/c1-12-7-14-9-16(24-3)20(25-4)22(26-5)18(14)19-15(8-13(12)2)10-17-21(23(19)27-6)29-11-28-17/h9-10,12-13H,7-8,11H2,1-6H3
charge 0 multiplicity 1
57 atoms
O  -5.061523 0.532916 0.124244
O  -3.814824 2.064131 1.472875
O  -0.75921 1.819621 1.790441
O  0.820339 2.089501 -0.72231
O  4.824545 -0.606783 0.412405
O  3.623514 1.879567 -0.719383
C  -0.997961 -3.461799 -0.665959
C  0.182021 -3.677825 0.334519
C  -0.992526 -2.056411 -1.365406
C  0.406597 -2.486164 1.330187
C  -1.653519 -0.933337 -0.574702
C  1.214654 -1.316906 0.783168
C  -0.892318 -0.011118 0.201989
C  0.591775 -0.134762 0.284698
C  -1.004291 -4.555783 -1.764047
C  -0.021164 -4.972575 1.162048
C  -3.071902 -0.804262 -0.665158
C  -1.539011 1.043985 0.929149
C  2.623995 -1.396951 0.799766
C  1.41908 0.916571 -0.182646
C  -3.669507 0.249158 0.022443
C  -2.932367 1.158926 0.803906
C  3.449665 -0.340107 0.349604
C  2.837906 0.844135 -0.153778
C  -5.126266 1.845828 0.808405
C  -1.021914 3.272799 1.80749
C  0.754983 2.068557 -2.200349
C  5.799721 0.494123 0.483655
C  3.53523 3.184348 -0.024274
H  -1.944354 -3.541665 -0.088316
H  1.111959 -3.788097 -0.264652
H  -1.541458 -2.165088 -2.321254
H  0.048401 -1.792574 -1.628322
H  0.950807 -2.892575 2.204543
H  -0.574293 -2.138688 1.703642
H  -1.879415 -4.437586 -2.430211
H  -0.093718 -4.48389 -2.390486
H  -1.04475 -5.575479 -1.343632
H  0.849235 -5.157148 1.818935
H  -0.915874 -4.884001 1.808747
H  -0.150418 -5.865343 0.526002
H  -3.664973 -1.499775 -1.264775
H  3.123685 -2.287813 1.194764
H  -5.285158 2.640086 0.05198
H  -5.913255 1.814936 1.576142
H  -2.061246 3.490081 2.109442
H  -0.808626 3.69569 0.809048
H  -0.316387 3.678466 2.548316
H  1.769425 1.978081 -2.631093
H  0.299961 3.027177 -2.495478
H  0.117702 1.230426 -2.541866
H  5.547898 1.193632 1.304376
H  5.851076 1.046641 -0.467442
H  6.758077 -0.002749 0.702108
H  3.944018 3.101547 1.002263
H  2.487443 3.528126 0.011365
H  4.151017 3.8769 -0.619324
