program: Gaussian 09
title: 000107968
version: EM64L-G09RevD.01
frameworkgroup: C1[X(C7H15N3O2S)]
method: RPBEPBE
basis: SDD
operation: Freq
keyword: #p
keyword: freq=noraman
keyword: PBEPBE/SDD
title: #p freq=noraman PBEPBE/SDD
converged: YES YES NO NO
title: Mulliken charges:
elementType: S O O N N N C C C C C C C H H H H H H H H H H H H H H H
charge: 0.136705 -0.435065 -0.228529 -0.620623 -0.015079 -0.571366 -0.388234 -0.405873 -0.134566 -0.438267 0.208708 -0.162637 -0.853347 0.223185 0.222109 0.241291 0.189223 0.213667 0.218226 0.223429 0.293943 0.275676 0.374846 0.321189 0.318503 0.246065 0.280806 0.266015
chargesum: 0.00000
title: Mulliken charges with hydrogens summed into heavy atoms:
elementType: S O O N N N C C C C C C C
charge: 0.136705 -0.060220 -0.228529 -0.051004 -0.015079 0.068327 0.057060 0.024641 0.079101 0.003388 0.208708 -0.162637 -0.060461
polarizability: 1.77976895e+02 2.43483830e+00 1.16285462e+02 -5.65522993e+00 4.35244208e+00 8.34117893e+01
1716.lowfreq: -7.9802 -0.0026 -0.0019 0.0013 4.4833 6.6464 17.5111 26.2580 33.1823
frequency: 16.8427 25.6996 33.1346 40.0155 53.9936 108.1724 130.9449 134.8888 157.1827 170.8693 206.3558 242.9297 274.8375 281.9341 294.8764 365.4780 370.0324 398.7359 418.2827 481.1861 490.4262 534.5146 557.8926 561.0264 569.1094 598.1678 626.6583 652.2582 706.6154 746.9769 808.6430 879.2688 889.8222 962.2799 976.5864 992.2729 1013.6035 1037.7398 1072.0958 1081.1788 1121.7459 1148.7074 1162.6621 1214.5195 1227.0773 1243.0209 1256.8258 1279.3193 1289.0649 1326.4412 1343.0141 1347.7292 1368.9524 1382.4530 1446.0836 1457.6015 1460.6467 1464.5897 1471.2194 1595.2513 1622.8024 1674.9719 1689.7313 2849.4924 2932.9286 2975.6724 2989.6024 2997.1152 3009.4634 3042.0802 3066.9332 3121.5547 3144.2304 3469.1678 3512.0605 3529.5138 3605.6380 3685.9668
redmass: 4.1814 4.6115 6.3789 4.5520 4.9026 4.9151 3.3676 1.2286 3.6096 2.3082 3.3083 2.4734 1.4037 2.7468 2.5137 2.3477 1.3185 5.6080 3.3825 1.6154 2.6371 3.3360 3.0828 2.6271 1.5246 4.5833 1.3186 7.3748 3.8139 1.5870 2.6560 2.5098 1.7803 1.1714 1.2397 2.9508 2.0766 2.4375 1.8959 2.7081 2.3661 1.6057 1.4733 1.3924 1.7170 1.9664 1.7143 1.2367 1.1405 1.3772 1.1713 1.3688 1.5801 1.7877 1.0571 1.0813 1.0841 1.0546 1.0957 1.1531 1.1001 8.8255 8.8581 1.0794 1.0582 1.0732 1.0678 1.0825 1.0290 1.0970 1.1032 1.1041 1.1044 1.0443 1.0639 1.0449 1.0991 1.1029
irintensity: 0.9323 0.8584 1.1583 2.2901 0.4324 0.9105 5.2867 2.6708 2.3494 5.9239 0.6577 5.9975 42.8995 7.7682 9.8307 44.5551 97.0411 23.8569 16.2845 87.2563 71.6184 13.7439 38.2226 55.0901 27.4412 44.9756 309.1433 3.2758 23.9161 15.7048 28.1601 20.9184 5.9121 6.1991 14.0291 22.7231 15.5193 320.9028 6.1488 20.2292 10.6419 5.4415 24.3716 11.1485 34.7833 97.4645 14.4637 2.5208 4.4656 30.8769 2.9847 40.0319 8.7420 18.0336 14.6981 6.5057 27.1874 12.1386 19.7493 76.3204 41.9574 202.6566 533.5320 73.1843 36.1770 5.6051 4.6046 75.2649 34.1757 2.6312 45.8367 17.6094 8.5720 1.2720 18.9701 28.1254 2.9679 19.4847
temp: 298.150 k
press: 1.00000 atm
elementType: 16 8 8 7 7 7 6 6 6 6 6 6 6 1 1 1 1 1 1 1 1 1 1 1 1 1 1 1
symmnumber: 1
zpe: 595078.6 jmol-1
zpe.correction: 0.226653 hartree
zpe.thermalcorrener: 0.243317 hartree
zpe.thermalcorrenthalpy: 0.244261 hartree
zpe.thermalcorrgfe: 0.179247 hartree
zpe.sumelectzpe: -987.447516 hartree
zpe.sumelectthermal: -987.430853 hartree
zpe.sumelectthermalent: -987.429909 hartree
zpe.sumelectthermalfe: -987.494923 hartree
dipole: -2.4080 2.9830 2.5283
dipole: 4.5923
quadrupole: -63.2500 -80.3598 -90.0087
quadrupole: -5.5956 1.8036 -1.7710
quadrupole: 14.6228 -2.4869 -12.1359 -5.5956 1.8036 -1.7710
hfenergy: -987.6741697 hartree
pointgroup: C01 [X(C7H15N3O2S1)]
dipole: 1.0507189 -0.8804713 1.1769025 debye
polarizability: 177.5742409|7.2067222|113.8153068|2.2034209|-10.5869543|86.2845984 unknown
InChI: InChI=1S/C7H15N3O2S/c1-13-7(9)10-4-2-3-5(8)6(11)12/h5,11H,2-4,8-9H2,1H3
charge 0 multiplicity 1
28 atoms
S  4.121585 1.13176 -0.653732
O  -4.792217 0.233134 0.886318
O  -3.502972 1.405995 -0.642175
N  -3.189701 -1.933673 0.172594
N  1.73376 -0.337973 -0.221188
N  3.741264 -1.439572 0.305571
C  -1.26645 -0.43749 -0.300839
C  -0.442091 0.790955 0.1364
C  -2.573913 -0.626909 0.492178
C  0.931043 0.849023 -0.566193
C  -3.611023 0.449078 0.150936
C  3.023497 -0.338545 -0.155231
C  5.54802 1.002714 0.583401
H  -0.635611 -1.337418 -0.161027
H  -1.508855 -0.369087 -1.377848
H  -0.998429 1.717235 -0.099527
H  -0.277824 0.764902 1.232649
H  -2.345764 -0.499924 1.581716
H  0.769295 0.869886 -1.664632
H  1.459579 1.789845 -0.297227
H  -4.055666 -2.127345 0.683538
H  -2.522452 -2.709686 0.184439
H  -5.466514 0.919611 0.630801
H  4.717867 -1.565869 0.054046
H  3.199411 -2.248397 0.609048
H  6.311071 0.28463 0.243892
H  5.158614 0.71809 1.571534
H  5.992077 2.009227 0.631262
