program: Gaussian 09
title: 000108014
version: EM64L-G09RevD.01
frameworkgroup: C1[X(C18H12O9)]
method: RPBEPBE
basis: SDD
operation: Freq
keyword: #pfreq=noraman
keyword: PBEPBE/SDD
title: #p freq=noraman PBEPBE/SDD
converged: YES YES NO NO
title: Mulliken charges:
elementType: O O O O O O O O O C C C C C C C C C C C C C C C C C C H H H H H H H H H H H H
charge: -0.180088 -0.264335 -0.484266 -0.402898 -0.358020 -0.297718 -0.327663 -0.379456 -0.378582 0.073998 -0.180939 -0.529238 -0.001920 -0.060496 0.266687 0.047738 0.189411 -0.609646 0.392566 -0.033458 -0.098810 0.081870 0.090891 0.087497 0.107157 -0.316862 -0.324074 0.295019 0.251954 0.286473 0.263927 0.371618 0.323543 0.380343 0.398200 0.266985 0.267736 0.390399 0.394455
chargesum: 0.00000
title: Mulliken charges with hydrogens summed into heavy atoms:
elementType: O O O O O O O O O C C C C C C C C C C C C C C C C C C
charge: -0.180088 -0.264335 -0.112648 -0.022556 0.040180 -0.297718 -0.327663 0.010943 0.015873 0.073998 0.114080 0.009190 -0.001920 0.203432 0.266687 0.047738 0.189411 -0.286103 0.392566 -0.033458 -0.098810 0.081870 0.090891 0.087497 0.107157 -0.049877 -0.056338
polarizability: 4.27979110e+02 -1.17880673e+00 2.43935781e+02 1.54579856e+01 7.17787058e+00 1.13545696e+02
1716.lowfreq: -7.7834 -0.0003 -0.0001 0.0004 2.6835 4.7163 30.2255 38.1274 54.8088
frequency: 30.1065 38.1074 54.8070 85.8442 99.2848 122.8807 136.3609 157.5144 166.9219 187.6666 208.2590 217.2066 236.9745 278.3931 294.5110 301.4230 331.2944 360.2961 367.4355 372.1057 379.9470 396.2126 401.6448 415.6123 422.8967 436.9003 453.4966 454.2829 471.6012 478.3141 497.7037 511.3345 551.8117 557.9047 575.8056 581.0682 610.5992 618.9596 643.7957 659.5966 691.7288 701.8651 708.1893 714.1863 733.8284 760.3980 774.1802 779.4867 800.7668 824.1692 830.2456 836.0913 844.8069 865.4692 915.5158 917.2641 951.9041 966.0515 972.1928 976.7125 1000.5380 1012.5541 1026.1722 1041.6465 1060.7199 1072.8009 1077.5586 1089.4567 1143.4247 1155.8798 1177.5727 1208.2407 1220.4005 1244.5305 1247.9641 1262.3851 1269.1744 1283.8609 1288.8432 1291.2101 1314.7260 1327.0113 1331.7747 1342.0061 1388.5766 1391.1043 1400.4088 1417.3703 1444.2098 1447.4694 1450.9486 1466.7006 1480.7069 1517.9090 1561.0968 1590.7612 1597.9729 1620.0100 1625.7767 2532.3340 2629.4727 3028.3690 3107.1856 3111.3498 3130.0500 3164.4978 3185.0700 3187.2439 3317.7497 3515.1888 3565.5550
redmass: 7.6498 6.9205 6.9545 7.3260 5.8544 7.7855 10.8787 7.9566 5.5004 6.6574 7.0651 7.3663 7.8284 5.3606 6.6670 5.7640 5.8919 5.6863 2.6308 3.0197 2.2200 1.9980 3.5439 3.1603 10.1389 6.3762 6.5518 9.1868 5.3945 6.1646 4.3349 5.0161 6.5987 4.6497 5.3292 5.6557 6.6895 7.0821 7.9198 6.0581 1.5512 5.4796 6.6095 2.9467 5.8285 9.1831 6.1456 7.9992 5.4268 5.3785 4.4785 1.6059 3.2568 5.0305 2.2613 2.1803 6.8067 1.1217 1.2518 2.7912 1.0645 4.8375 3.5077 4.2723 2.7078 3.5539 2.8053 5.8902 1.2046 1.5034 1.9203 1.5643 1.7756 2.0246 1.4625 1.7669 1.3992 1.7751 2.5985 5.0605 2.1675 2.2127 2.5921 2.8850 6.0832 1.2200 4.0922 8.5795 7.5144 2.3912 1.1178 5.6125 3.0633 8.9466 2.3389 5.3466 3.3772 7.1897 8.1823 1.0739 1.0731 1.0645 1.0998 1.0911 1.0917 1.0883 1.0981 1.0933 1.0663 1.0655 1.0663
irintensity: 0.0798 1.6017 2.3228 0.1507 0.6133 0.4552 0.6697 3.1454 7.1058 0.0111 1.3324 1.2636 0.7099 1.8484 9.2173 7.1868 1.9044 0.0582 11.0951 3.4519 10.6945 94.7693 18.9678 59.9572 8.7436 1.2864 3.9720 24.0596 24.3195 9.4480 24.2849 12.7727 21.9657 13.5071 16.4093 8.1474 17.5575 6.5264 18.7157 13.4821 42.5244 61.6137 64.5850 84.0058 6.7822 22.6404 9.8131 204.7769 13.9266 5.3983 44.5278 63.6739 26.0559 30.0410 28.3108 12.4195 16.9948 77.4730 45.9403 32.8086 120.3407 256.0698 48.2358 39.3333 161.9705 72.7774 52.0443 54.5064 52.7335 7.9739 54.1344 24.1256 49.3025 304.2938 76.0887 254.3605 74.2436 53.5053 60.9303 104.6255 133.3100 19.0343 125.3778 12.3740 30.0333 76.4169 159.4849 257.4131 36.8382 298.7593 8.5382 22.1482 5.4473 196.2922 132.2938 76.0459 19.9088 202.3605 22.3026 99.6213 65.4891 6.9224 3.5238 6.3150 27.1548 0.5532 6.4758 7.5030 298.6463 25.0836 15.0399
temp: 298.150 k
press: 1.00000 atm
elementType: 8 8 8 8 8 8 8 8 8 6 6 6 6 6 6 6 6 6 6 6 6 6 6 6 6 6 6 1 1 1 1 1 1 1 1 1 1 1 1
symmnumber: 1
zpe: 712361.1 jmol-1
zpe.correction: 0.271324 hartree
zpe.thermalcorrener: 0.292277 hartree
zpe.thermalcorrenthalpy: 0.293222 hartree
zpe.thermalcorrgfe: 0.222371 hartree
zpe.sumelectzpe: -1368.248166 hartree
zpe.sumelectthermal: -1368.227213 hartree
zpe.sumelectthermalent: -1368.226269 hartree
zpe.sumelectthermalfe: -1368.297119 hartree
dipole: -4.4571 2.3427 -0.5532
dipole: 5.0656
quadrupole: -137.6139 -172.2749 -155.6756
quadrupole: -22.2198 4.6586 0.2894
quadrupole: 17.5742 -17.0867 -0.4874 -22.2198 4.6586 0.2894
hfenergy: -1368.5194901 hartree
pointgroup: C01 [X(C18H12O9)]
dipole: 1.7722803 0.8169423 0.4043951 debye
polarizability: 428.458819|-4.1866434|239.0409017|8.2065344|25.9335882|117.9608666 unknown
InChI: InChI=1S/C18H12O9/c19-6-1-2-7(20)12-11(6)14(22)5-3-8-13(16(24)10(5)15(12)23)18(25)4-9(21)27-17(18)26-8/h1-3,9,17,19-21,24-25H,4H2
charge 0 multiplicity 1
39 atoms
O  5.39904 -0.724595 -0.015858
O  3.171536 -1.690071 0.166676
O  3.692686 1.705445 1.528169
O  4.69385 -0.859669 -2.333549
O  1.108788 2.528368 0.822713
O  -1.588916 2.72182 0.573825
O  -1.853226 -2.719297 -0.426691
O  -4.079754 2.892186 0.45054
O  -4.368509 -2.591116 -0.569484
C  3.510674 0.713198 0.46151
C  4.194456 -0.674412 0.723798
C  4.154128 1.148802 -0.899906
C  2.050028 0.352903 0.397385
C  5.151706 0.021087 -1.302911
C  1.922794 -1.028305 0.175163
C  0.927561 1.194769 0.508766
C  -0.37634 0.627522 0.294924
C  0.677808 -1.634072 -0.018202
C  -0.459792 -0.789404 0.027796
C  -1.608199 1.437882 0.353524
C  -1.780463 -1.439786 -0.184294
C  -2.901092 0.773254 0.149529
C  -2.984369 -0.631024 -0.114493
C  -4.100202 1.546447 0.207487
C  -4.257975 -1.251592 -0.313703
C  -5.368382 0.907717 0.008176
C  -5.448007 -0.460809 -0.246685
H  4.386212 -0.945584 1.771944
H  4.695452 2.10258 -0.769068
H  3.401546 1.293735 -1.689901
H  6.13248 0.381495 -1.639379
H  4.642382 1.978434 1.598495
H  0.548213 -2.703868 -0.193967
H  3.938452 -1.411307 -1.995549
H  2.049981 2.650923 1.152592
H  -6.266791 1.529296 0.062151
H  -6.40953 -0.95812 -0.401201
H  -3.063819 3.146975 0.559724
H  -3.395709 -2.974309 -0.576546
