program: Gaussian 09
title: 000107936
version: EM64L-G09RevD.01
frameworkgroup: C1[X(C13H11NO3)]
method: RPBEPBE
basis: SDD
operation: Freq
keyword: #p
keyword: freq=noraman
keyword: PBEPBE/SDD
title: #p freq=noraman PBEPBE/SDD
converged: YES YES NO NO
title: Mulliken charges:
elementType: O O O N C C C C C C C C C C C C C H H H H H H H H H H H
charge: -0.217192 -0.262528 -0.279364 0.028616 0.290257 0.221833 -0.172467 0.079451 -0.095312 0.283836 -0.413859 -0.331186 -0.380120 -0.216677 -0.186552 -0.523956 -0.497287 0.267702 0.257729 0.253006 0.227838 0.265053 0.244928 0.231177 0.230813 0.250439 0.216726 0.227099
chargesum: 0.00000
title: Mulliken charges with hydrogens summed into heavy atoms:
elementType: O O O N C C C C C C C C C C C C C
charge: -0.217192 -0.262528 -0.279364 0.028616 0.290257 0.221833 -0.172467 0.079451 -0.095312 0.283836 -0.146157 -0.073458 -0.127115 0.011161 0.078501 0.182962 0.196976
polarizability: 2.30680888e+02 -1.70130944e+01 2.03200151e+02 6.24556246e-01 4.27692855e-01 7.01980034e+01
1716.lowfreq: -8.5669 -6.8521 0.0008 0.0009 0.0011 7.3829 28.6223 63.2474 100.7336
frequency: 28.6104 63.2369 100.7318 106.5202 167.2154 178.5386 192.5258 216.6525 223.9589 274.3182 275.6440 297.1970 346.1584 356.8716 370.7028 409.4303 467.1140 520.1467 531.9583 549.9019 559.1957 585.3471 621.6904 645.4187 713.9806 728.0055 739.7850 767.6471 786.0596 819.0017 845.3205 852.7107 853.9919 898.6375 928.5790 946.3245 975.0747 1008.5817 1041.0090 1048.4082 1075.9977 1109.0471 1112.8477 1140.1915 1148.0752 1161.1430 1172.2637 1207.2608 1232.1922 1254.8188 1295.0263 1322.8379 1328.8316 1392.5613 1394.3880 1435.2455 1443.0631 1451.3158 1457.3545 1465.8349 1473.3476 1476.0946 1515.6461 1532.5174 1577.9381 1602.2193 1609.2474 2980.3870 3001.1102 3079.9504 3110.1288 3128.1973 3132.8432 3140.7207 3168.5860 3185.0256 3235.5381 3265.6307
redmass: 3.0924 3.4336 4.6894 4.7495 4.0208 4.6941 1.7931 3.7498 1.8030 1.2104 3.3074 5.2943 6.2442 4.3414 5.6312 6.2968 6.5874 5.7315 7.2511 3.8962 5.5545 4.5406 7.5758 7.4058 2.3830 8.2936 1.7385 2.0748 7.4666 2.7656 6.6622 6.6801 1.3529 1.4094 6.6703 7.8277 1.3156 4.1315 3.8789 4.1476 1.9081 1.2431 1.2489 1.3804 1.4113 1.4131 1.2407 2.7905 4.5437 2.7960 3.9534 2.3253 4.1899 5.4519 3.7435 1.3899 1.3018 1.0572 1.0581 2.2710 1.0517 1.0481 5.7794 5.6235 8.1610 6.8553 10.9398 1.0315 1.0288 1.1051 1.1043 1.1053 1.1010 1.0874 1.0931 1.0964 1.0903 1.1081
irintensity: 8.2990 0.2797 9.8748 3.0633 2.0244 2.2743 0.5281 3.5659 0.2802 0.1558 2.7896 0.3178 0.0273 14.5770 0.0973 4.9627 0.7764 5.2543 1.5742 0.3597 3.5608 3.7800 6.0919 0.4858 24.9252 4.3398 80.4597 15.1277 18.1955 34.7067 7.9746 2.7493 0.6350 1.0881 36.4858 13.1513 1.8087 2.4288 138.4208 101.8645 26.3895 1.3620 0.0176 42.9094 10.6144 23.0002 17.8120 13.3443 27.2892 66.3664 30.0551 111.7158 155.0358 72.5320 33.8642 17.4959 2.8660 17.4142 47.5403 12.6210 16.9025 26.2288 291.9140 16.7057 10.1976 2.8329 60.0422 51.0406 62.4689 33.8060 42.3237 27.1104 19.5536 14.8432 7.9817 10.2353 4.7857 2.1879
temp: 298.150 k
press: 1.00000 atm
elementType: 8 8 8 7 6 6 6 6 6 6 6 6 6 6 6 6 6 1 1 1 1 1 1 1 1 1 1 1
symmnumber: 1
zpe: 555411.9 jmol-1
zpe.correction: 0.211545 hartree
zpe.thermalcorrener: 0.225875 hartree
zpe.thermalcorrenthalpy: 0.226819 hartree
zpe.thermalcorrgfe: 0.170034 hartree
zpe.sumelectzpe: -781.160984 hartree
zpe.sumelectthermal: -781.146654 hartree
zpe.sumelectthermalent: -781.145710 hartree
zpe.sumelectthermalfe: -781.202495 hartree
dipole: 4.6128 1.1934 0.5370
dipole: 4.7949
quadrupole: -78.1234 -92.3431 -101.8279
quadrupole: 2.4377 -1.3715 -0.8930
quadrupole: 12.6414 -1.5783 -11.0631 2.4377 -1.3715 -0.8930
hfenergy: -781.372529 hartree
pointgroup: C01 [X(C13H11N1O3)]
dipole: -1.7507242 0.6983026 -0.0775704 debye
polarizability: 234.2220321|13.6435399|198.1898561|-3.4344018|13.0485049|71.6671542 unknown
InChI: InChI=1S/C13H11NO3/c1-15-10-5-3-4-8-11(10)14-13-9(6-7-17-13)12(8)16-2/h3-7H,1-2H3
charge 0 multiplicity 1
28 atoms
O  -1.638729 -2.428367 -0.175259
O  -1.581363 2.391811 0.233817
O  3.446979 -1.204351 -0.172761
N  0.484246 -1.34139 -0.138911
C  0.446578 1.143769 0.079862
C  -1.00098 1.133992 0.111644
C  1.154801 -0.125392 -0.052908
C  -1.679849 -0.097893 0.021922
C  -0.830012 -1.262514 -0.096997
C  2.601818 -0.099931 -0.080009
C  1.172706 2.368952 0.190761
C  -3.051234 -0.601047 0.01373
C  3.279383 1.127134 0.037715
C  2.570257 2.349019 0.174029
C  -2.973355 -1.969647 -0.103004
C  -3.042882 2.519148 0.280369
C  3.000393 -2.537161 -0.622104
H  0.618349 3.304487 0.291558
H  -3.981308 -0.044364 0.083337
H  4.373154 1.105946 0.019087
H  3.133128 3.284407 0.261734
H  -3.728866 -2.749411 -0.14895
H  -3.228477 3.598606 0.37632
H  -3.458238 1.989707 1.156883
H  -3.502062 2.142787 -0.651627
H  2.354089 -3.016063 0.128104
H  3.941233 -3.095358 -0.755198
H  2.447941 -2.472178 -1.574544
