program: Gaussian 09
title: 000107932
version: EM64L-G09RevD.01
frameworkgroup: C1[X(C10H3Cl5)]
method: RPBEPBE
basis: SDD
operation: Freq
keyword: #pfreq=noraman
keyword: PBEPBE/SDD
title: #p freq=noraman PBEPBE/SDD
converged: NO NO NO NO
title: Mulliken charges:
elementType: Cl Cl Cl Cl Cl C C C C C C C C C C H H H
charge: 0.023086 -0.010001 0.019739 0.016055 0.015893 0.546443 0.574205 -0.349311 -0.382763 -0.369971 -0.370791 -0.121157 -0.248731 -0.102315 -0.106919 0.289485 0.290098 0.286955
chargesum: 0.00000
title: Mulliken charges with hydrogens summed into heavy atoms:
elementType: Cl Cl Cl Cl Cl C C C C C C C C C C
charge: 0.023086 -0.010001 0.019739 0.016055 0.015893 0.546443 0.574205 -0.349311 -0.382763 -0.080487 -0.080693 -0.121157 0.038224 -0.102315 -0.106919
polarizability: 2.58849280e+02 1.71132004e+00 1.87306378e+02 -6.58698260e-04 2.41009554e-03 5.38716862e+01
1716.lowfreq: -0.0020 0.0005 0.0029 2.1424 5.0182 7.3802 48.8308 55.8937 97.0352
frequency: 48.8226 55.8935 97.0350 129.9330 168.0670 171.4286 188.1246 202.4539 203.0395 261.4049 291.4535 308.6700 319.0525 365.7347 420.3089 427.3832 452.9780 507.0412 551.4522 559.4381 605.1027 630.9963 655.8968 662.9590 734.4707 763.1404 868.6707 881.7815 890.7671 899.9898 908.6658 969.4733 1122.1870 1156.1890 1202.1949 1254.0023 1264.6012 1331.9508 1380.1087 1398.0187 1417.9797 1470.1972 1543.0605 1565.0225 1606.6447 3167.7218 3171.8699 3175.4998
redmass: 26.7682 27.1092 14.0418 25.6978 7.7021 32.1162 30.3193 5.8720 28.6453 20.1662 24.4009 7.1186 29.5125 9.9110 11.1450 3.3554 12.8053 8.5063 4.7419 6.0129 8.9195 8.6992 5.5289 8.0057 10.3789 3.6794 1.4212 8.2365 1.5819 1.4240 7.0233 8.4927 2.1658 2.0152 5.2830 1.3564 2.7922 4.7712 6.4536 4.8674 4.7453 5.1242 10.2716 8.2036 8.1134 1.0916 1.0920 1.0931
irintensity: 0.0062 0.0116 0.1469 0.0134 0.1090 0.1716 0.0030 0.0032 0.0294 0.4374 0.0508 0.5846 0.0695 1.6321 4.6853 13.0945 21.4730 14.3624 2.3974 17.7792 0.0809 36.5158 0.6800 2.3890 11.2635 1.0200 17.5140 32.0691 1.1516 45.9318 8.8878 148.1065 55.9672 24.1059 94.3281 13.2390 36.1923 4.7863 29.6222 7.4241 34.1065 78.7758 4.6284 82.3167 16.0749 3.1290 2.2205 2.9033
temp: 298.150 k
press: 1.00000 atm
elementType: 17 17 17 17 17 6 6 6 6 6 6 6 6 6 6 1 1 1
symmnumber: 1
zpe: 253781.0 jmol-1
zpe.correction: 0.096660 hartree
zpe.thermalcorrener: 0.110169 hartree
zpe.thermalcorrenthalpy: 0.111114 hartree
zpe.thermalcorrgfe: 0.054630 hartree
zpe.sumelectzpe: -2682.128322 hartree
zpe.sumelectthermal: -2682.114813 hartree
zpe.sumelectthermalent: -2682.113869 hartree
zpe.sumelectthermalfe: -2682.170352 hartree
dipole: 0.8150 0.7839 0.0000
dipole: 1.1308
quadrupole: -125.5869 -118.0508 -121.8582
quadrupole: 2.1483 -0.0001 0.0001
quadrupole: -3.7549 3.7812 -0.0262 2.1483 -0.0001 0.0001
hfenergy: -2682.2249823 hartree
pointgroup: C01 [X(C10H3Cl5)]
dipole: -0.3370637 0.2903497 -0.0000041 debye
dipolederiv: -0.0719268 -0.0650993 0.0000015 -0.198752 -0.6681446 0.0000714 -0.0000065 -0.0000024 -0.0065655 -0.1059655 -0.0653157 -0.0000006 0.0302169 -0.7821447 0.0000018 -0.0000178 0.00001 -0.0328694 -0.7997091 -0.1633296 -0.0000077 -0.2426825 -0.1055067 -0.0000029 0.0001321 0.0000222 -0.0136802 -0.5726009 0.2979278 0.0000382 0.4568996 -0.3131683 -0.0000373 0.0000292 -0.0000188 -0.0173112 -0.7566121 -0.1941874 0.0000041 -0.3358527 -0.1415584 -0.0000008 0.000066 0.0000129 -0.0172768 0.1875752 -0.0463726 -0.0000118 -0.1300461 -0.1979579 0.000049 -0.0000429 -0.0000061 0.0692512 0.0615761 -0.008293 0.0000058 0.1256748 -0.3215178 -0.0000193 0.0000526 0.0000083 0.05335 -0.236424 0.1564546 0.0000071 0.2744287 0.9597546 -0.000136 0.0000509 0.0000332 -0.0840949 0.1926379 0.0870522 0.000026 -0.1739138 1.2280704 0.0000324 0.0000259 -0.000029 -0.0927069 -0.3269558 0.1710386 0.0000182 0.0031249 -0.1293506 -0.0000002 0.0000385 -0.0000215 -0.0874532 -0.2620948 -0.1586859 -0.0000068 0.0476044 -0.0719608 -0.0000021 0.0000007 0.0000022 -0.0826089 1.1558167 0.2208037 0. 0.3581918 0.0498662 0.0000108 -0.0002257 -0.0000097 -0.0426297 -0.3648066 -0.1381561 0.0000026 -0.0946749 -0.2719899 -0.0000064 -0.0000049 -0.0000141 -0.0479507 0.6612253 -0.6816138 -0.0000808 -0.6959219 0.5055652 0.0000584 -0.0000545 0.0000631 -0.0472375 0.9778348 0.570234 0.0000029 0.5698418 0.117291 -0.0000168 -0.0000744 -0.0000365 -0.0500249 0.10178 -0.0254828 0.0000082 0.0219962 0.0398138 -0.0000039 0.0000141 -0.0000042 0.1652106 0.0983881 0.0102774 -0.0000032 -0.0386598 0.0419596 0.0000029 -0.0000058 0.0000028 0.1652567 0.0602615 0.0327479 -0.0000036 0.0225247 0.0609788 -0.000001 0.0000227 -0.0000125 0.1693414 unknown
polarizability: 258.8215835|2.2157002|187.3340742|-0.0005256|-0.0024426|53.8716862 unknown
InChI: InChI=1S/C10H3Cl5/c11-6-3-9(14)10(15)5-2-8(13)7(12)1-4(5)6/h1-3H
charge 0 multiplicity 1
18 atoms
Cl -1.773643 -2.913389 0.000299
Cl -0.93431 3.480462 0.000001
Cl -4.3038 -0.861473 -0.000123
Cl 3.671721 -2.055509 -0.000245
Cl 4.126313 1.184504 -0.000004
C  -0.172267 -0.605598 0.000113
C  0.032515 0.834198 0.000032
C  -1.513942 -1.124827 0.00013
C  -1.127188 1.680384 -0.000017
C  0.975071 -1.458642 0.000016
C  1.366103 1.346248 0.000017
C  -2.60764 -0.254531 -0.000195
C  -2.416072 1.158292 -0.000147
C  2.264222 -0.928848 -0.000094
C  2.463448 0.487548 0.000043
H  0.841522 -2.543814 0.000012
H  1.52749 2.427995 0.000001
H  -3.286543 1.819901 -0.000138
