program: Gaussian 09
title: 000107909
version: EM64L-G09RevD.01
frameworkgroup: C1[X(H3O3P)]
method: RPBEPBE
basis: SDD
operation: Freq
keyword: #p
keyword: freq=noraman
keyword: PBEPBE/SDD
title: #p freq=noraman PBEPBE/SDD
converged: NO YES NO NO
title: Mulliken charges:
elementType: P O O O H H H
charge: 1.084052 -0.740320 -0.776445 -0.711562 0.392439 0.374533 0.377303
chargesum: 0.00000
title: Mulliken charges with hydrogens summed into heavy atoms:
elementType: P O O O
charge: 1.084052 -0.347881 -0.401911 -0.334259
polarizability: 3.68237416e+01 9.25677587e-01 3.49398620e+01 -9.61471143e-01 1.22007287e+00 2.74025015e+01
1716.lowfreq: -13.5264 -0.0025 0.0015 0.0029 7.0887 10.4751 141.8315 275.7416 305.4289
frequency: 141.8277 275.7399 305.4245 339.2164 384.7687 427.4798 636.8931 674.7197 689.7037 948.7299 976.5843 1030.2516 3543.5320 3547.3956 3618.1772
redmass: 2.7579 2.9093 1.3736 4.2445 1.0617 1.5104 13.8013 8.0229 10.1952 1.1329 1.2376 1.2395 1.0650 1.0656 1.0666
irintensity: 72.6554 95.9352 67.3290 65.6286 55.5823 189.8290 156.2730 189.7453 166.1027 55.1482 85.7941 57.0985 51.0803 21.6692 34.1980
temp: 298.150 k
press: 1.00000 atm
elementType: 15 8 8 8 1 1 1
symmnumber: 1
zpe: 104915.2 jmol-1
zpe.correction: 0.039960 hartree
zpe.thermalcorrener: 0.045795 hartree
zpe.thermalcorrenthalpy: 0.046739 hartree
zpe.thermalcorrgfe: 0.011424 hartree
zpe.sumelectzpe: -568.371646 hartree
zpe.sumelectthermal: -568.365811 hartree
zpe.sumelectthermalent: -568.364866 hartree
zpe.sumelectthermalfe: -568.400182 hartree
dipole: -1.3703 -1.9214 0.8513
dipole: 2.5088
quadrupole: -32.8529 -30.0307 -27.8700
quadrupole: 1.6612 1.9738 2.0662
quadrupole: -2.6017 0.2205 2.3812 1.6612 1.9738 2.0662
hfenergy: -568.4116058 hartree
pointgroup: C01 [X(H3O3P1)]
dipole: -0.8368146 0.028298 -0.5227011 debye
dipolederiv: 1.3504831 0.1276053 -0.057837 0.275543 1.5067581 -0.0741798 0.0307648 -0.0428071 1.1809981 -0.525415 0.1853245 0.1629535 0.14946 -1.0072402 0.0482544 0.2696567 -0.2495805 -0.6140828 -0.8800192 -0.1760614 -0.1424167 -0.2629857 -0.5563139 0.0828148 -0.5073156 0.0532675 -0.7726297 -0.8040106 -0.2554174 -0.0040828 -0.2240263 -0.8586605 0.1548947 0.160302 0.451778 -0.5270407 0.22892 0.016123 -0.103223 -0.0310168 0.365385 -0.0666456 -0.0911015 -0.0633517 0.2742434 0.2402846 0.1387163 0.0395336 0.1224154 0.272837 -0.0865182 0.037027 -0.0823411 0.3253046 0.3897572 -0.0362904 0.1050724 -0.0293895 0.2772345 -0.0586202 0.1006665 -0.066965 0.1332072 unknown
polarizability: 36.2411124|0.7818207|35.1497352|1.5183168|1.999832|27.7752574 unknown
InChI: InChI=1S/H3O3P/c1-4(2)3/h1-3H
charge 0 multiplicity 1
7 atoms
P  -0.02168 -0.145917 0.964515
O  0.917245 -1.457538 0.299205
O  -1.284843 -0.455959 -0.257516
O  0.815029 1.227016 0.298712
H  0.433733 -1.934105 -0.428065
H  -2.134521 0.042009 -0.168346
H  1.204737 1.129295 -0.610205
