program: Gaussian 09
title: 000107879
version: EM64L-G09RevD.01
frameworkgroup: C1[X(O8S2)]
method: RPBEPBE
basis: SDD
operation: Freq
keyword: #pfreq=noraman
keyword: PBEPBE/SDD
title: #p freq=noraman PBEPBE/SDD
converged: YES YES NO NO
title: Mulliken charges:
elementType: S S O O O O O O O O
charge: 1.121299 1.121300 -0.193189 -0.193245 -0.637904 -0.655343 -0.655328 -0.634844 -0.634916 -0.637830
chargesum: -2.00000
title: Mulliken charges with hydrogens summed into heavy atoms:
polarizability: 2.18383454e+02 4.51691156e-03 8.18071101e+01 -3.40564559e+00 -4.69619875e-03 7.85875246e+01
1716.lowfreq: -14.4262 -4.1896 -0.0022 -0.0021 -0.0018 2.3565 11.7030 25.3569 42.4181
frequency: 11.6390 25.3285 42.4180 77.9567 91.3373 119.7742 141.4412 189.8906 217.5309 304.9967 328.8035 342.4580 349.3563 369.1564 387.4249 425.3869 437.8035 717.7386 733.4806 855.9118 862.2387 863.9201 866.3467 1025.3602
redmass: 16.0974 16.0315 17.5171 16.8958 16.7505 17.1954 16.4238 16.3610 16.0489 16.1506 16.5736 17.1863 17.3247 17.3840 17.6283 21.3377 19.7254 17.1056 17.3977 20.8245 20.9528 20.9101 20.9387 16.0095
irintensity: 0.0211 0.5225 0.1454 0.3357 0.4748 0.9616 0.2243 0.6553 24.1546 13.7823 1.0841 7.7214 19.5030 38.9487 4.8076 298.5498 3.8339 377.5004 7.0561 10.1241 190.6279 44.7693 256.2037 59.0952
temp: 298.150 k
press: 1.00000 atm
elementType: 16 16 8 8 8 8 8 8 8 8
symmnumber: 1
zpe: 58543.4 jmol-1
zpe.correction: 0.022298 hartree
zpe.thermalcorrener: 0.035024 hartree
zpe.thermalcorrenthalpy: 0.035968 hartree
zpe.thermalcorrgfe: -0.021019 hartree
zpe.sumelectzpe: -1396.767454 hartree
zpe.sumelectthermal: -1396.754729 hartree
zpe.sumelectthermalent: -1396.753785 hartree
zpe.sumelectthermalfe: -1396.810772 hartree
dipole: -0.0006 -0.7261 -0.0009
dipole: 0.7261
quadrupole: -153.7674 -92.7695 -92.5194
quadrupole: -0.0018 1.3654 0.0034
quadrupole: -40.7486 20.2493 20.4994 -0.0018 1.3654 0.0034
hfenergy: -1396.7897525 hartree
pointgroup: C01 [X(O8S2)]
dipole: -0.0006848 -0.188455 0.2146688 debye
dipolederiv: 2.1999832 0.0265522 -0.0889758 -0.1115171 1.323857 0.0298215 0.5104944 0.012432 1.3057257 2.2005808 -0.0867642 0.039807 0.4903213 1.3105497 0.0150753 -0.1745111 0.0317462 1.3176182 -0.2730361 -0.34323 0.3726534 -0.0016972 0.0365422 -0.2282599 -0.0863083 0.1411714 -0.4271484 -0.271395 0.3249235 -0.3889598 -0.086333 -0.43117 0.2028877 0.008823 -0.1664361 0.0390095 -0.8669277 -0.0895311 -0.0714741 -0.3390509 -0.7249604 -0.1849432 -0.3943826 -0.1392633 -0.7095994 -1.2130913 0.1782577 -0.017503 0.3140774 -0.7344889 0.0131623 -0.0224727 0.0218202 -0.5783941 -1.2137389 0.0083947 0.1778471 0.0229125 -0.5765821 -0.0003129 0.3139853 -0.0093648 -0.7355262 -0.8469992 0.1028627 -0.053935 0.4125771 -0.835976 0.1613892 -0.3240046 0.1584566 -0.6554962 -0.8498332 -0.0396956 0.1100109 -0.265652 -0.6155656 0.1276489 0.452411 0.1305238 -0.8738141 -0.8655424 -0.0817698 -0.0794709 -0.435638 -0.7522059 -0.1364689 -0.2840344 -0.181086 -0.682375 unknown
polarizability: 218.3948886|-2.5095173|79.9784477|-1.9238376|-1.6016993|80.4047525 unknown
InChI: InChI=1S/2O3S.O2/c2*1-4(2)3;1-2
charge -2 multiplicity 1
10 atoms
S  -2.478779 0.069801 -0.117193
S  2.479172 0.102015 -0.078762
O  -0.508308 -0.236023 0.962014
O  0.50552 -0.92438 0.360086
O  -2.663749 -1.23114 -1.115941
O  3.392064 -1.252576 0.174298
O  -3.393888 0.005588 1.257912
O  -2.563855 1.524335 -0.89434
O  2.57178 0.675853 -1.624579
O  2.660141 1.266628 1.076505
