program: Gaussian 09
title: 000107900
version: EM64L-G09RevD.01
frameworkgroup: C1[X(C18H15NO2)]
method: RPBEPBE
basis: SDD
operation: Freq
keyword: #p
keyword: freq=noraman
keyword: PBEPBE/SDD
title: #p freq=noraman PBEPBE/SDD
converged: YES YES NO NO
title: Mulliken charges:
elementType: O O N C C C C C C C C C C C C C C C C C C H H H H H H H H H H H H H H H
charge: -0.429980 -0.438310 -0.702782 0.437655 -0.356873 0.039798 0.364951 0.248027 -0.189586 0.203919 -0.469648 -0.284358 -0.435430 -0.264733 0.287074 -0.841563 0.362102 -0.373262 -0.377174 -0.267318 -0.277283 0.236091 0.223353 0.239694 0.211911 0.224397 0.230816 0.208289 0.225947 0.198986 0.334428 0.344624 0.229796 0.230185 0.312026 0.314232
chargesum: 0.00000
title: Mulliken charges with hydrogens summed into heavy atoms:
elementType: O O N C C C C C C C C C C C C C C C C C C
charge: -0.095552 -0.093686 -0.076523 0.437655 -0.120782 0.039798 0.364951 0.248027 0.033767 0.203919 -0.229955 -0.072447 -0.211032 -0.033917 0.287074 -0.633274 0.362102 -0.147315 -0.178188 -0.037522 -0.047098
polarizability: 3.84951641e+02 -2.37655141e+00 2.25728224e+02 3.57034922e+00 -7.35262467e+00 1.00312550e+02
1716.lowfreq: -9.7870 -5.1232 -1.3616 -0.0009 -0.0008 -0.0006 31.9460 46.1540 62.3899
frequency: 31.7885 46.1382 62.3822 92.9923 129.8468 148.2785 167.5379 209.0389 228.5808 260.7540 263.4920 272.2525 282.3289 314.4642 325.9640 335.4099 349.4745 390.5851 397.1950 435.8813 443.2651 469.8226 478.5264 496.1325 512.8924 532.8372 560.5871 569.6834 590.3027 626.9110 638.6112 663.5248 683.6509 733.5119 749.9349 763.7114 772.3271 778.5852 818.6376 831.6946 851.1634 857.1105 860.7142 885.5170 916.0121 927.6270 945.7111 952.4097 965.9277 967.3341 985.8818 986.1257 1038.7311 1051.4804 1063.4599 1103.5325 1121.7531 1157.7029 1169.0717 1177.2007 1187.7321 1195.2543 1218.7982 1228.8856 1259.6093 1267.6120 1289.7806 1298.8080 1308.4517 1314.3531 1344.9136 1380.9874 1391.3464 1395.5845 1411.8285 1417.2089 1430.9473 1459.1628 1461.7389 1508.8808 1541.3539 1578.9911 1591.0136 1614.4703 1625.4288 1634.2245 1646.8236 2967.4017 3029.5536 3121.1774 3130.1054 3132.5646 3136.2017 3143.0902 3153.2735 3161.0005 3162.2675 3171.8976 3526.4345 3543.8013 3577.2960 3716.6180
redmass: 5.1278 5.3414 4.4844 3.3669 3.9909 5.0837 5.2239 3.8567 4.4440 3.1083 1.2527 1.3033 3.8606 1.2113 3.6876 3.4837 4.8757 4.3043 1.4207 2.1673 5.2927 4.6558 3.6994 5.8216 5.8138 4.0960 4.1235 4.1910 3.9466 3.6231 4.1762 4.8854 4.3801 2.0305 3.6318 1.5071 4.7381 1.8707 2.7932 1.5021 5.4155 2.0691 2.8439 3.1242 3.2657 5.9040 1.5183 1.8984 2.5758 1.3774 1.7770 2.1679 2.1823 2.6550 2.5164 1.7456 2.0756 1.5628 1.2493 1.2941 1.1238 1.2243 1.4990 1.7093 1.6146 1.8398 1.5520 2.1177 1.9088 1.6575 1.2055 2.7112 2.7952 3.0676 3.0509 3.3756 2.3640 2.5869 3.6879 3.7611 4.1609 7.3088 6.3857 5.1265 5.0326 6.1311 1.3293 1.0841 1.0856 1.0853 1.0859 1.0877 1.0888 1.0892 1.0947 1.0966 1.0968 1.0957 1.0660 1.0663 1.0456 1.1025
irintensity: 0.5474 0.1350 0.3305 3.5136 16.0152 0.6444 0.7203 3.9519 5.2545 12.7752 90.8229 52.3830 6.5795 101.0387 13.1884 7.1267 5.5826 2.1316 183.9089 12.5445 6.4423 2.0446 1.7733 0.4739 4.6569 4.5043 1.1442 1.6536 4.3019 8.3494 6.7351 2.5683 29.6319 8.7330 11.8821 135.6255 3.8647 0.2614 1.7353 56.9342 4.5369 3.9580 24.1706 48.7944 7.2411 105.9895 3.6141 8.7192 15.1684 1.6347 4.5888 11.6205 22.2123 2.9000 3.0890 11.1608 22.5257 4.2918 3.8735 32.4415 7.8910 44.9542 2.9244 9.1966 8.1826 10.7342 21.3799 26.7721 14.1893 12.3949 67.4727 9.7287 15.7779 6.4964 3.1242 19.8903 16.4195 41.2144 9.1661 46.4109 28.7931 1.1776 2.3397 60.1668 67.3917 17.4751 338.2488 33.1708 48.8333 8.6531 1.7307 2.8231 17.1202 11.5527 20.2958 44.0430 18.7502 34.0450 5.4239 11.7685 79.9778 22.3949
temp: 298.150 k
press: 1.00000 atm
elementType: 8 8 7 6 6 6 6 6 6 6 6 6 6 6 6 6 6 6 6 6 6 1 1 1 1 1 1 1 1 1 1 1 1 1 1 1
symmnumber: 1
zpe: 742407.7 jmol-1
zpe.correction: 0.282768 hartree
zpe.thermalcorrener: 0.300231 hartree
zpe.thermalcorrenthalpy: 0.301176 hartree
zpe.thermalcorrgfe: 0.237952 hartree
zpe.sumelectzpe: -898.663728 hartree
zpe.sumelectthermal: -898.646265 hartree
zpe.sumelectthermalent: -898.645321 hartree
zpe.sumelectthermalfe: -898.708544 hartree
dipole: 2.9056 2.1836 0.3310
dipole: 3.6497
quadrupole: -105.7276 -98.2812 -133.4161
quadrupole: 7.2668 5.1983 -3.0215
quadrupole: 6.7473 14.1938 -20.9411 7.2668 5.1983 -3.0215
hfenergy: -898.9464965 hartree
pointgroup: C01 [X(C18H15N1O2)]
dipole: 1.1285001 0.8770664 0.138013 debye
polarizability: 385.0225154|0.3840311|225.9103889|1.8041706|-5.0973283|100.0595103 unknown
InChI: InChI=1S/C18H15NO2/c19-16-9-15-11(10-3-1-2-4-13(10)16)5-6-14-12(15)7-8-17(20)18(14)21/h1-9,17-18,20-21H,19H2
charge 0 multiplicity 1
36 atoms
O  -3.934736 -1.281951 -1.576776
O  -4.677579 0.262723 1.761735
N  2.655833 3.074499 -0.143467
C  -2.13907 -0.857988 -0.049837
C  -3.649645 -0.963475 -0.152939
C  -1.495171 0.40249 -0.118011
C  -0.04773 0.473904 -0.078857
C  0.720552 -0.746748 0.019216
C  -4.409262 0.311709 0.293908
C  2.185044 -0.667853 0.045134
C  -1.371924 -2.043489 0.062972
C  -2.334625 1.607925 -0.231204
C  0.026794 -1.989064 0.091531
C  -3.691638 1.587107 -0.069618
C  2.848495 0.610987 -0.015859
C  0.646646 1.730493 -0.124703
C  2.038662 1.825143 -0.095935
C  3.002007 -1.83884 0.126896
C  4.276625 0.66099 0.003984
C  4.400411 -1.768008 0.147372
C  5.048156 -0.504217 0.084605
H  -4.013806 -1.788879 0.495636
H  -5.424876 0.287681 -0.141249
H  -1.886584 -3.009586 0.106839
H  -1.852739 2.567245 -0.445095
H  0.583237 -2.926601 0.172058
H  -4.283073 2.506094 -0.142688
H  0.073882 2.661543 -0.177043
H  2.532167 -2.82513 0.172058
H  4.802795 1.620769 -0.047983
H  -4.897004 -1.514482 -1.655807
H  -3.851857 0.552903 2.229647
H  4.994245 -2.68629 0.209337
H  6.141513 -0.442483 0.097296
H  3.663082 3.181198 -0.113603
H  2.090874 3.916182 -0.208753
