program: Gaussian 09
title: 000107868
version: EM64L-G09RevD.01
frameworkgroup: C1[X(C13H8Cl4O2S)]
method: RPBEPBE
basis: SDD
operation: Freq
keyword: #p
keyword: freq=noraman
keyword: PBEPBE/SDD
title: #p freq=noraman PBEPBE/SDD
converged: YES YES NO NO
title: Mulliken charges:
elementType: Cl Cl Cl Cl S O O C C C C C C C C C C C C C H H H H H H H H
charge: 0.044558 0.008043 0.003836 0.008506 0.915200 -0.516731 -0.546940 -0.035170 0.438324 -0.422950 0.372308 -0.155813 -0.370457 -0.092576 -0.729671 -0.327462 -0.386086 -0.100438 -0.212633 -0.114318 0.318378 0.272572 0.297406 0.269968 0.277642 0.276407 0.245481 0.262616
chargesum: 0.00000
title: Mulliken charges with hydrogens summed into heavy atoms:
elementType: Cl Cl Cl Cl S O O C C C C C C C C C C C C C
charge: 0.044558 0.008043 0.003836 0.008506 0.915200 -0.516731 -0.546940 -0.035170 0.438324 -0.104572 0.372308 -0.155813 -0.097885 -0.092576 0.115345 -0.051055 -0.140605 -0.100438 0.049983 -0.114318
polarizability: 3.51682704e+02 -8.22912296e+00 2.27917695e+02 5.44843865e+00 9.34022532e+00 1.10789476e+02
1716.lowfreq: -6.6508 -4.4833 -1.0197 -0.0023 -0.0012 -0.0012 24.5420 34.7095 47.6175
frequency: 24.5256 34.7059 47.6147 57.2494 62.3802 106.5568 126.1995 140.5179 150.9005 165.8885 174.3589 182.2429 189.6719 199.3578 228.4505 231.5775 249.0193 257.5277 283.1183 323.4223 341.6230 360.0969 385.5322 416.8281 438.8287 447.4795 456.7762 507.7600 514.4757 554.1380 563.6637 588.1426 631.3529 661.3355 705.4789 710.3751 715.1121 725.4204 796.3294 821.7659 837.4863 884.2415 894.3064 902.1659 939.6778 952.5747 975.2347 992.5300 1003.1544 1014.5643 1056.9269 1123.6317 1135.5732 1157.2360 1196.7686 1257.6298 1287.9599 1302.9537 1318.2102 1360.4707 1387.5501 1391.8884 1408.6934 1421.9039 1426.3562 1476.3585 1535.3425 1563.6046 1592.2096 1596.3786 3031.8246 3126.2223 3148.9489 3164.0462 3168.3292 3174.8280 3179.8200 3190.1276
redmass: 11.2585 8.6548 14.5343 9.8161 8.3239 6.8350 7.7766 1.5792 2.1936 13.6206 7.1544 6.9590 27.3386 13.7870 8.3677 5.0776 13.5253 6.1654 8.2123 7.7003 7.8575 8.8982 9.4696 9.8241 3.2117 9.2434 8.0289 5.4956 5.5773 8.6722 5.8675 7.8500 5.6104 7.3711 4.2960 5.9992 3.9213 7.5350 12.7149 1.3693 8.6319 1.4483 3.1202 1.5616 1.3973 1.3657 1.6244 3.4216 5.1111 1.8780 3.7677 2.3372 2.1201 1.5072 1.7662 1.4423 2.4209 1.1372 2.7181 8.7103 4.9916 3.2871 1.0568 1.1030 2.8198 3.4269 7.4585 8.3099 6.9841 6.3868 1.0245 1.0911 1.0889 1.0923 1.0921 1.0964 1.1071 1.1081
irintensity: 0.1066 1.4127 1.1328 2.1291 2.5384 0.2898 3.9381 1.1789 3.7105 0.1203 0.1330 0.0770 0.0461 0.4929 0.2851 0.4016 1.2741 0.2511 2.8407 13.6131 16.6947 14.8556 59.8061 6.1104 9.5700 17.4362 21.1234 4.2904 0.8610 1.8584 17.9484 23.8379 6.8937 15.8319 8.4134 10.5554 9.1699 39.6905 51.1678 41.4227 7.5448 29.6149 31.8406 3.3335 8.5638 0.8649 11.6470 96.1882 13.6121 50.2023 32.1113 93.1614 24.6451 1.9818 20.5715 1.8829 2.6517 6.7191 23.3415 6.5734 34.4619 4.2460 13.3304 49.6243 164.0709 19.2349 32.8308 9.8641 24.8362 6.7207 0.4497 19.4089 5.1874 0.4972 0.5226 2.3634 0.1649 0.7036
temp: 298.150 k
press: 1.00000 atm
elementType: 17 17 17 17 16 8 8 6 6 6 6 6 6 6 6 6 6 6 6 6 1 1 1 1 1 1 1 1
symmnumber: 1
zpe: 455511.2 jmol-1
zpe.correction: 0.173495 hartree
zpe.thermalcorrener: 0.193689 hartree
zpe.thermalcorrenthalpy: 0.194633 hartree
zpe.thermalcorrgfe: 0.122409 hartree
zpe.sumelectzpe: -2887.333288 hartree
zpe.sumelectthermal: -2887.313094 hartree
zpe.sumelectthermalent: -2887.312150 hartree
zpe.sumelectthermalfe: -2887.384374 hartree
dipole: -0.2180 4.1171 4.2692
dipole: 5.9350
quadrupole: -160.5116 -158.0728 -150.7448
quadrupole: 5.2899 -14.0763 -5.6199
quadrupole: -4.0685 -1.6297 5.6983 5.2899 -14.0763 -5.6199
hfenergy: -2887.5067831 hartree
pointgroup: C01 [X(C13H8Cl4O2S1)]
dipole: -0.0964971 -1.6321381 1.6670544 debye
polarizability: 349.112212|-19.7367838|230.7484438|-2.6953066|-8.2551792|110.5292201 unknown
InChI: InChI=1S/C13H8Cl4O2S/c1-20(18,19)12-6-8(5-11(16)13(12)17)7-2-3-9(14)10(15)4-7/h2-6H,1H3
charge 0 multiplicity 1
28 atoms
Cl 4.492891 -1.252468 -0.173149
Cl 2.455903 -3.7903 -0.426116
Cl -4.285977 2.496057 -0.972756
Cl -6.22638 0.125688 0.231581
S  3.162947 1.903814 0.124133
O  4.206035 1.978252 -1.121295
O  2.03326 3.069882 0.338134
C  2.130717 0.263462 0.045926
C  -0.138051 -0.633732 -0.000247
C  0.748238 0.4713 0.104306
C  -1.613756 -0.446127 0.056959
C  2.704833 -1.009616 -0.111296
C  0.426742 -1.925687 -0.163478
C  1.820914 -2.10968 -0.213745
C  4.154434 1.784743 1.753797
C  -2.203157 0.760338 -0.404674
C  -2.466181 -1.461095 0.570911
C  -3.597675 0.942273 -0.356151
C  -3.860974 -1.27782 0.620205
C  -4.433114 -0.075182 0.15478
H  0.392269 1.498903 0.24957
H  -0.217878 -2.800511 -0.286137
H  4.685372 2.744821 1.820592
H  3.418916 1.661028 2.560193
H  4.838258 0.931886 1.653456
H  -1.587366 1.556171 -0.833861
H  -2.043579 -2.389407 0.968204
H  -4.511439 -2.057293 1.02686
