program: Gaussian 09
title: 000107878
version: EM64L-G09RevD.01
frameworkgroup: C1[X(C11H15N3O7)]
method: RPBEPBE
basis: SDD
operation: Freq
keyword: #p
keyword: freq=noraman
keyword: PBEPBE/SDD
title: #p freq=noraman PBEPBE/SDD
converged: YES YES NO NO
title: Mulliken charges:
elementType: O O O O O O O N N N C C C C C C C C C C C H H H H H H H H H H H H H H H
charge: -0.203464 -0.201176 -0.231040 -0.444837 -0.464791 -0.383323 -0.416613 -0.448386 -0.060180 -0.639948 0.274646 -0.286185 -0.187428 -0.225885 -0.230477 -0.322470 0.213853 0.125741 -0.240842 -0.374498 0.175021 0.333760 0.294686 0.289344 0.281565 0.273642 0.263217 0.302205 0.185868 0.260366 0.365520 0.349484 0.380928 0.348428 0.337166 0.306102
chargesum: 0.00000
title: Mulliken charges with hydrogens summed into heavy atoms:
elementType: O O O O O O O N N N C C C C C C C C C C C
charge: -0.203464 -0.201176 -0.231040 -0.079317 -0.115307 -0.002395 -0.068185 -0.146181 -0.060180 0.003319 0.274646 0.047575 0.107258 0.063459 0.051088 -0.048828 0.213853 0.125741 0.022375 0.071737 0.175021
polarizability: 1.70757822e+02 8.81409283e+00 1.36432756e+02 -2.87356074e+00 -5.44819830e-01 1.40321529e+02
1716.lowfreq: -13.3165 -5.1694 -0.0009 -0.0008 0.0004 5.3484 80.6603 103.6735 125.7944
frequency: 80.6567 103.6715 125.7872 139.0016 158.5496 173.1427 197.4427 238.0587 248.6496 268.4232 275.4307 294.5427 299.9748 319.9784 333.4171 345.8687 351.8027 369.3021 374.4304 406.2009 436.9431 449.3452 469.5768 480.4104 483.1056 490.1563 512.7579 519.5251 526.6370 542.4273 582.1835 593.4898 616.2127 635.0596 667.1354 700.4675 712.5022 747.7760 772.0899 778.1026 821.1416 827.4920 852.0124 876.5764 886.0108 893.7400 903.3722 935.9725 955.4256 967.0243 983.6418 990.2119 998.3948 1028.6676 1035.8651 1045.3252 1066.6578 1084.3327 1096.7410 1103.7140 1115.7435 1153.7563 1162.4680 1167.9826 1191.3770 1203.7657 1216.7943 1229.3636 1244.3501 1258.7946 1273.1305 1275.8104 1287.5302 1288.8228 1304.0081 1312.2024 1321.2714 1350.1311 1357.9262 1360.5282 1367.3733 1375.7477 1379.5148 1461.9460 1466.4718 1575.4061 1626.0842 2920.4761 3031.1686 3077.9326 3079.2649 3086.3571 3095.7317 3110.5867 3111.0373 3493.7045 3505.9801 3523.2051 3527.0012 3548.2303 3553.5060 3699.4453
redmass: 5.7952 5.5520 5.6523 6.1251 4.3899 3.5240 5.9192 6.4489 2.4503 4.1089 4.7628 4.1167 2.8944 3.1740 1.7348 2.4479 1.3225 3.8683 3.0858 5.2143 5.2507 3.7783 3.6436 2.3121 1.8415 2.3972 1.3593 1.5176 1.6043 3.0436 5.2060 4.1805 5.4656 5.3582 5.6035 8.3046 6.6201 5.5680 5.7477 4.2422 5.3982 6.7485 5.0897 5.0816 3.7365 2.9546 4.8445 3.6528 4.5502 4.3891 3.7833 2.6616 2.9713 2.6071 2.0481 2.8003 2.5204 2.8059 2.3917 2.7912 2.3000 3.5058 2.4257 1.2399 1.5832 2.3226 1.5106 1.9611 1.4795 1.4116 1.3900 1.4644 1.4334 1.3187 1.3040 1.4226 1.4652 1.6106 1.6598 1.6788 1.5242 1.3795 1.9283 1.0819 3.4978 2.0232 1.8609 1.0720 1.0870 1.0872 1.0863 1.0861 1.0881 1.0904 1.0910 1.0651 1.0649 1.0768 1.0660 1.0450 1.0645 1.1042
irintensity: 0.1420 13.0424 4.1214 2.4931 5.6282 12.5692 5.3414 2.9279 41.8423 10.6854 36.5246 3.7268 16.9753 28.1700 84.5216 34.4255 31.5139 13.1083 30.2485 35.2764 7.8243 44.5435 56.4913 48.0458 51.4591 49.5559 217.5523 37.7977 166.1523 24.7775 17.7630 31.3972 5.3255 24.8531 10.3671 11.2623 67.6979 31.3417 12.6530 31.8206 14.8850 156.3642 34.8483 43.1454 75.3654 13.3534 4.3194 36.2655 66.2825 42.7851 19.5040 53.4641 75.4112 8.8232 43.4480 49.4254 2.6396 55.8221 74.5808 81.0110 15.0362 51.4155 57.3015 62.4527 56.0724 18.5207 10.9404 46.5527 2.4802 21.9353 7.9694 52.8719 25.1360 15.6070 5.3267 10.6530 4.7530 45.0541 17.0146 26.9674 26.4521 28.2742 25.5383 8.0480 260.1004 96.4512 434.2878 66.6335 25.6733 8.4020 12.7384 1.8578 2.6334 5.9650 22.7187 16.0225 8.5908 23.9537 5.6732 63.9107 30.7417 34.9921
temp: 298.150 k
press: 1.00000 atm
elementType: 8 8 8 8 8 8 8 7 7 7 6 6 6 6 6 6 6 6 6 6 6 1 1 1 1 1 1 1 1 1 1 1 1 1 1 1
symmnumber: 1
zpe: 722930.2 jmol-1
zpe.correction: 0.275350 hartree
zpe.thermalcorrener: 0.292823 hartree
zpe.thermalcorrenthalpy: 0.293768 hartree
zpe.thermalcorrgfe: 0.233197 hartree
zpe.sumelectzpe: -1117.347490 hartree
zpe.sumelectthermal: -1117.330016 hartree
zpe.sumelectthermalent: -1117.329072 hartree
zpe.sumelectthermalfe: -1117.389643 hartree
dipole: 0.5811 -3.2915 5.2387
dipole: 6.2141
quadrupole: -114.0292 -120.0925 -128.8007
quadrupole: 6.4532 -2.9008 -3.5705
quadrupole: 6.9450 0.8816 -7.8266 6.4532 -2.9008 -3.5705
hfenergy: -1117.6228398 hartree
pointgroup: C01 [X(C11H15N3O7)]
dipole: 0.2142963 -1.3343534 2.0373298 debye
polarizability: 171.2834565|7.4837132|135.8126186|-3.3299205|-0.6350133|140.4160317 unknown
InChI: InChI=1S/C11H15N3O7/c12-8-13-6-2-4-9(17,1-15)5-3(16)10(2,14-8)7(19-6)11(18,20-4)21-5/h2-7,14-18H,1,12H2
charge 0 multiplicity 1
36 atoms
O  1.311776 0.844193 -1.26645
O  -1.406617 1.328136 -1.236088
O  1.609145 1.375301 1.064769
O  -0.315072 0.508513 2.993584
O  1.631154 -2.393976 0.532283
O  1.024708 3.021036 -0.493938
O  3.7712 -1.807843 -1.180524
N  -2.261213 -0.331037 0.971357
N  -2.841677 -0.672441 -1.351077
N  -4.436366 -1.005784 0.346626
C  -0.85829 -0.043107 0.638442
C  -0.469094 -0.825291 -0.654848
C  -0.701181 1.397903 0.05506
C  1.022418 -0.592813 -0.975379
C  0.050629 -0.332316 1.844925
C  1.510212 -0.07052 1.424139
C  1.930474 -0.968716 0.22833
C  0.806652 1.680471 -0.185271
C  -1.497599 -0.153437 -1.612436
C  3.42923 -0.862579 -0.120406
C  -3.155217 -0.662306 -0.06107
H  -0.657377 -1.906503 -0.569463
H  -1.152428 2.200379 0.659786
H  1.335485 -1.13069 -1.882835
H  -0.100979 -1.368561 2.185558
H  2.190167 -0.189611 2.28794
H  -1.266296 -0.203169 -2.684952
H  -2.596037 0.027452 1.868969
H  4.032852 -1.049423 0.797953
H  3.669893 0.137473 -0.50925
H  0.086559 1.406386 2.838514
H  2.087171 -2.649677 1.376839
H  1.933711 3.133657 -0.875479
H  3.353947 -2.678279 -0.940538
H  -5.105696 -1.203385 -0.39382
H  -4.622743 -1.337336 1.289654
