program: Gaussian 09
title: 000107873
version: EM64L-G09RevD.01
frameworkgroup: C1[X(C20H40)]
method: RPBEPBE
basis: SDD
operation: Freq
keyword: #p
keyword: freq=noraman
keyword: PBEPBE/SDD
title: #p freq=noraman PBEPBE/SDD
converged: YES YES NO NO
title: Mulliken charges:
elementType: C C C C C C C C C C C C C C C C C C C C H H H H H H H H H H H H H H H H H H H H H H H H H H H H H H H H H H H H H H H H
charge: -0.018892 -0.114520 -0.518030 -0.490949 -0.438497 -0.472783 -0.444805 -0.388666 -0.395220 -0.387491 -0.378747 -0.382411 -0.375236 -0.375139 -0.354163 -0.352756 -0.356842 -0.357395 -0.696847 -0.696669 0.199950 0.222855 0.212819 0.217544 0.206664 0.210474 0.212756 0.213669 0.200801 0.194509 0.208348 0.204123 0.195713 0.201058 0.199830 0.187356 0.192567 0.193231 0.187062 0.193320 0.192445 0.191229 0.188855 0.190721 0.189581 0.190227 0.188737 0.187046 0.187880 0.187281 0.195014 0.194655 0.194940 0.194741 0.209537 0.214778 0.209731 0.209543 0.214856 0.209614
chargesum: 0.00000
title: Mulliken charges with hydrogens summed into heavy atoms:
elementType: C C C C C C C C C C C C C C C C C C C C
charge: 0.181058 0.108334 -0.087667 -0.073811 -0.012072 -0.077474 -0.032334 0.008104 -0.008034 -0.001693 0.001635 0.001263 0.004341 0.004669 0.021619 0.022405 0.032827 0.032286 -0.062800 -0.062656
polarizability: 2.34553778e+02 -5.43180670e+00 2.31345589e+02 2.27224653e+00 1.58604446e+00 1.81768142e+02
1716.lowfreq: -15.8931 -5.8911 -0.0004 0.0008 0.0010 5.7861 12.0023 18.2430 28.0600
frequency: 8.4862 15.8872 27.6398 33.8692 42.5484 46.6828 50.0328 72.2394 77.8939 91.0892 94.9496 101.2157 112.9079 125.3750 132.8970 139.7753 142.1522 155.5968 170.3297 178.1499 195.5721 226.1742 226.6685 229.5509 252.9495 310.1604 330.8777 366.6305 371.6347 433.9724 448.5052 461.6177 484.7736 531.7641 612.2026 641.9722 717.9300 719.5795 724.8408 725.7750 741.4409 752.0700 772.4778 787.4743 805.4786 837.4978 840.5201 858.6075 886.2019 886.8273 891.0529 901.0073 927.3210 938.6435 976.5496 980.7335 991.1416 996.2434 1003.9618 1015.2180 1018.1620 1024.6419 1037.9091 1043.0612 1052.0335 1064.0012 1068.7567 1076.7549 1077.6811 1080.5899 1084.2015 1095.0090 1103.2075 1115.2067 1120.9266 1141.1060 1178.6771 1183.9091 1190.6161 1191.6610 1205.4686 1212.8949 1216.9280 1227.0573 1231.9732 1243.6819 1247.9782 1257.8039 1262.4771 1266.2091 1273.4051 1279.2777 1281.7505 1282.9086 1287.4223 1289.4474 1291.3149 1293.0204 1293.5840 1296.3547 1303.7527 1307.0569 1312.0884 1326.7654 1332.0908 1343.1543 1348.3373 1350.1734 1351.6864 1355.1866 1356.4111 1359.9549 1386.3454 1387.8003 1456.8227 1459.3457 1460.4071 1460.9228 1462.6895 1464.6657 1466.3269 1467.3156 1469.4931 1471.9336 1474.9975 1475.7733 1475.9934 1476.3377 1480.0760 1482.9006 1486.3009 1488.0251 1489.1791 1491.2670 2932.9884 2948.3257 2948.5932 2948.6468 2949.0597 2951.1012 2952.1312 2952.6800 2957.1561 2957.7061 2962.4702 2963.3244 2967.1168 2968.2832 2970.8992 2970.9464 2971.8848 2982.0034 2982.2950 2983.4863 2986.8613 2988.9822 2991.7948 2994.4654 3000.9537 3004.2506 3007.7137 3014.4869 3017.2501 3028.4041 3030.5862 3034.8521 3039.5442 3041.1856 3049.8348 3067.5040 3067.6216 3069.5238 3070.0970 3070.1787
redmass: 3.9812 1.5804 3.4083 2.8081 1.7134 3.1210 3.4436 2.2257 2.0479 2.0721 1.7596 2.6272 2.3337 2.7762 2.0248 2.2557 1.8561 2.5206 2.6422 3.2736 2.5166 1.8171 1.1316 1.4829 3.0105 2.9925 2.9733 2.4066 3.5616 2.8722 2.9685 2.7340 3.0546 2.4264 3.0768 2.2720 1.0658 1.0612 1.0807 1.0990 1.1352 1.1941 1.3459 1.3071 1.5532 1.5651 1.7615 1.4601 1.8751 1.8989 1.9010 1.6387 1.3345 1.8741 2.0688 1.5305 3.1272 1.6512 2.6568 1.5488 2.6793 1.9695 2.2697 2.8059 1.9712 2.4133 1.7692 2.1055 2.1931 2.2566 2.0848 1.8531 1.7135 2.2177 2.0796 2.9158 1.6478 1.7686 1.5678 1.5026 1.4533 1.3024 1.3634 1.4060 1.3191 1.2995 1.2637 1.2969 1.2860 1.3067 1.2458 1.0690 1.0485 1.1157 1.2271 1.1194 1.2730 1.1093 1.2086 1.1313 1.3235 1.2767 1.3619 1.4185 1.4141 1.5034 1.5390 1.6809 1.6289 1.6781 1.6586 1.5182 1.2171 1.2168 1.0740 1.0726 1.0732 1.0719 1.0709 1.0691 1.0789 1.0775 1.0784 1.0802 1.0791 1.0567 1.0429 1.0643 1.0799 1.0856 1.0878 1.0904 1.0954 1.0946 1.0825 1.0587 1.0589 1.0587 1.0587 1.0593 1.0594 1.0596 1.0594 1.0595 1.0603 1.0622 1.0595 1.0583 1.0366 1.0370 1.0741 1.0955 1.0959 1.0605 1.0944 1.0907 1.0824 1.0940 1.0988 1.1020 1.0676 1.1028 1.1040 1.1044 1.1043 1.1014 1.1044 1.1042 1.1002 1.1007 1.1007 1.0993 1.1043 1.0993
irintensity: 0.0003 0.0026 0.0022 0.0031 0.0008 0.0199 0.0020 0.0004 0.0082 0.0029 0.0016 0.0049 0.0041 0.0110 0.0021 0.0015 0.0006 0.0015 0.0084 0.0141 0.0118 0.0422 0.0028 0.0306 0.1060 0.0183 0.0073 0.3162 0.6959 0.0736 1.0189 0.1005 0.1019 2.1445 1.4896 3.4651 13.6319 14.2268 0.7238 0.4181 2.1327 3.2277 5.1192 0.2093 0.8502 2.5094 0.0924 2.2499 5.2793 4.7054 1.6910 3.6029 0.0904 2.6253 0.4475 0.4083 0.1762 0.2727 0.8842 3.4202 0.4382 0.4428 1.6454 1.0851 0.2242 2.6705 0.0923 0.1362 0.5017 0.0583 0.2617 3.0603 12.1260 8.8382 6.1392 1.4877 0.2954 1.6351 0.4293 3.9621 1.9843 11.2559 3.9901 1.7881 1.5715 0.2810 1.5334 0.2540 1.0189 0.3328 0.8844 0.0877 0.2763 0.1315 0.7296 0.7519 0.2004 0.8148 0.5694 0.0537 1.4159 1.2827 0.0723 1.3232 0.9022 0.7326 0.5568 1.0231 0.5954 0.4739 0.2804 3.7244 11.1813 11.3916 1.8507 0.1197 0.2087 0.1155 0.3492 1.6329 0.6426 0.8288 2.4801 1.6841 8.4655 10.0855 11.5943 3.9674 3.8892 3.9799 2.7648 33.7913 18.5618 8.2624 20.5581 0.0559 0.2603 0.0556 0.4316 0.5593 0.3713 1.4257 5.6695 12.8495 74.8096 13.3687 123.6576 135.5267 35.5924 36.6763 82.8635 0.2365 0.0438 40.2050 1.2165 18.2626 52.8997 31.5075 11.8886 5.8587 44.7716 4.8518 9.0099 1.2013 3.5624 9.5620 224.7866 189.4094 31.5203 96.5747 94.5171 63.0309 114.2005 55.3355
temp: 298.150 k
press: 1.00000 atm
elementType: 6 6 6 6 6 6 6 6 6 6 6 6 6 6 6 6 6 6 6 6 1 1 1 1 1 1 1 1 1 1 1 1 1 1 1 1 1 1 1 1 1 1 1 1 1 1 1 1 1 1 1 1 1 1 1 1 1 1 1 1
symmnumber: 1
zpe: 1458793.2 jmol-1
zpe.correction: 0.555625 hartree
zpe.thermalcorrener: 0.581813 hartree
zpe.thermalcorrenthalpy: 0.582757 hartree
zpe.thermalcorrgfe: 0.493611 hartree
zpe.sumelectzpe: -784.452749 hartree
zpe.sumelectthermal: -784.426561 hartree
zpe.sumelectthermalent: -784.425617 hartree
zpe.sumelectthermalfe: -784.514763 hartree
dipole: -0.0894 -0.0875 0.0714
dipole: 0.1440
quadrupole: -131.8036 -131.8986 -132.1403
quadrupole: 0.9107 -0.2376 -0.6653
quadrupole: 0.1439 0.0489 -0.1928 0.9107 -0.2376 -0.6653
hfenergy: -785.0083739 hartree
pointgroup: C01 [X(C20H40)]
dipole: 0.0328159 0.0364604 0.0283258 debye
polarizability: 235.2428896|-5.1706235|230.6828333|-2.0256748|-1.5393569|181.7417865 unknown
InChI: InChI=1S/C20H40/c1-3-5-7-9-11-13-16-20-18-14-17-19(20)15-12-10-8-6-4-2/h19-20H,3-18H2,1-2H3
charge 0 multiplicity 1
60 atoms
C  -0.305029 3.203423 0.043103
C  -1.345754 2.25818 0.732857
C  -1.183141 4.150908 -0.82766
C  -2.46455 3.268368 1.117758
C  -2.557667 4.25859 -0.087945
C  0.855312 2.536126 -0.726546
C  -1.865797 1.111849 -0.17357
C  1.748378 1.630848 0.153176
C  -2.724974 0.070118 0.581333
C  2.94711 1.019588 -0.606692
C  -3.21062 -1.086436 -0.321277
C  3.814332 0.092542 0.274762
C  -4.014103 -2.163449 0.443002
C  5.01063 -0.534399 -0.476449
C  -4.488757 -3.327694 -0.455321
C  5.862842 -1.472065 0.408544
C  -5.270752 -4.416492 0.315226
C  7.058404 -2.105361 -0.339493
C  -5.734182 -5.580074 -0.587751
C  7.899593 -3.042884 0.553972
H  0.144084 3.8131 0.858939
H  -0.904021 1.798332 1.640702
H  -0.70255 5.13664 -0.966751
H  -1.314933 3.714611 -1.83692
H  -3.430819 2.779026 1.336303
H  -2.16521 3.816606 2.03222
H  -2.762085 5.288608 0.255845
H  -3.386446 3.978231 -0.763509
H  0.454172 1.947334 -1.577364
H  1.484377 3.331371 -1.179143
H  -2.453404 1.532519 -1.015705
H  -1.006445 0.580449 -0.630068
H  2.12369 2.218415 1.017516
H  1.135429 0.810802 0.580514
H  -3.604572 0.563353 1.043354
H  -2.129146 -0.348038 1.420339
H  2.573115 0.448418 -1.482398
H  3.579076 1.835563 -1.015954
H  -2.333119 -1.562529 -0.807634
H  -3.834217 -0.675424 -1.142732
H  4.190339 0.66511 1.148588
H  3.176832 -0.71771 0.687126
H  -3.388518 -2.568458 1.266107
H  -4.894626 -1.691012 0.927176
H  4.635352 -1.100638 -1.354726
H  5.655412 0.273927 -0.880894
H  -5.126625 -2.927177 -1.271007
H  -3.609061 -3.791536 -0.949303
H  6.240161 -0.906474 1.286364
H  5.21734 -2.27926 0.814338
H  -6.151628 -3.953951 0.805948
H  -4.632679 -4.811586 1.132123
H  7.704457 -1.298778 -0.742605
H  6.680884 -2.668643 -1.217372
H  -4.86978 -6.078679 -1.065904
H  -6.289712 -6.344129 -0.013102
H  -6.397667 -5.215024 -1.394477
H  7.282814 -3.873488 0.946589
H  8.746432 -3.484468 -0.003144
H  8.314125 -2.4956 1.42179
