program: Gaussian 09
title: 000107885
version: EM64L-G09RevD.01
frameworkgroup: C1[X(C21H28O4)]
method: RPBEPBE
basis: SDD
operation: Freq
keyword: #pfreq=noraman
keyword: PBEPBE/SDD
title: #p freq=noraman PBEPBE/SDD
converged: YES YES NO NO
title: Mulliken charges:
elementType: O O O O C C C C C C C C C C C C C C C C C C C C C H H H H H H H H H H H H H H H H H H H H H H H H H H H H
charge: -0.280951 -0.454106 -0.436010 -0.248932 -0.166889 0.308442 -0.205768 -0.499114 0.155341 -0.505350 -0.334895 0.185221 -0.764270 -0.740687 0.258998 0.157612 -0.650345 0.620629 -0.651244 0.055442 -0.572893 -0.383874 -0.334352 -0.360047 -0.694458 0.236838 0.257338 0.224299 0.210535 0.228281 0.245872 0.300523 0.228766 0.237993 0.211201 0.230957 0.255027 0.223372 0.258415 0.225211 0.201025 0.209328 0.203677 0.211060 0.360374 0.185629 0.189406 0.378143 0.195127 0.197966 0.210467 0.216221 0.209451
chargesum: 0.00000
title: Mulliken charges with hydrogens summed into heavy atoms:
elementType: O O O O C C C C C C C C C C C C C C C C C C C C C
charge: -0.280951 -0.093732 -0.057867 -0.248932 0.069949 0.308442 0.051570 -0.064280 0.155341 -0.031197 -0.034372 0.185221 -0.086310 -0.031332 0.258998 0.157612 -0.391930 0.620629 -0.426033 0.055442 -0.162541 0.030863 0.040682 0.033045 -0.058319
polarizability: 3.37220341e+02 -8.03307881e+00 2.31143452e+02 -6.40690461e+00 -1.97917452e+00 1.68892285e+02
1716.lowfreq: -9.9945 -0.0010 -0.0007 -0.0002 4.7448 6.7551 21.2408 26.9842 51.2981
frequency: 20.3874 26.8511 51.0691 52.0203 56.1914 58.3083 75.5584 95.2075 110.4622 127.2744 150.3887 162.7919 189.9955 202.9186 204.7421 210.8274 227.1105 228.8142 243.0518 257.5180 264.3113 270.2325 300.0751 308.7851 328.9677 336.7948 364.0954 369.7041 381.1317 391.4848 417.8304 435.0809 454.2878 470.7374 492.8977 496.3042 541.6269 553.4023 588.2158 595.9737 599.3115 614.4930 630.4727 655.2684 686.2178 705.8504 716.6975 726.5213 754.5288 760.2273 781.2217 801.8474 809.9885 821.4718 838.3568 871.5777 891.0141 894.0965 922.4219 930.3816 939.2971 953.2881 954.9178 967.4392 980.0046 984.3067 1000.4611 1005.6267 1010.4491 1044.9904 1046.8687 1077.3612 1087.9394 1091.5588 1110.4464 1119.1876 1124.5879 1133.0537 1145.0451 1167.7970 1175.6028 1190.5115 1196.2137 1201.8011 1209.0028 1234.2961 1238.8526 1249.6446 1258.3322 1267.7296 1275.5537 1283.7901 1291.2494 1295.5831 1298.4874 1307.1789 1320.4790 1326.0493 1339.3882 1349.0722 1353.3147 1367.0562 1377.1635 1383.6646 1388.8558 1395.5168 1399.7331 1418.6144 1454.3330 1463.5469 1464.5846 1465.9511 1467.6703 1473.8815 1475.2811 1476.6276 1482.7556 1482.7766 1489.4639 1490.6895 1504.5738 1588.7759 1625.5361 1628.5832 1658.4399 2921.6503 2952.5088 2966.1753 2970.3371 2972.1903 2976.4816 2978.4018 2986.3228 2991.7619 2992.0728 2993.7889 3001.5335 3012.7954 3026.7628 3034.6692 3047.7637 3048.3140 3068.6063 3071.4990 3091.8870 3094.0283 3098.8683 3107.0583 3108.6421 3143.8136 3153.9844 3522.3533 3588.7620
redmass: 4.6686 4.9062 2.1803 3.5948 5.2161 5.5692 3.9231 2.3166 4.4757 1.8036 3.5508 3.2442 3.3355 2.4218 3.4084 1.8006 1.1437 3.8056 3.1414 2.8598 3.6310 1.1706 2.1969 3.5964 2.8255 3.5225 1.5033 2.8386 2.8381 2.7830 2.8296 3.2408 4.9486 3.9468 4.4779 4.1649 4.7521 5.9307 3.7151 4.1165 1.5020 3.1199 3.3478 4.7833 3.7221 3.9570 2.9523 1.0698 1.1385 4.1630 1.9396 3.9865 3.2633 1.8048 1.2715 1.5296 2.2236 2.6291 2.0096 2.0514 1.6485 1.5404 1.4997 2.1933 3.7715 2.9579 3.0672 3.0839 1.9055 1.9364 3.0864 2.3677 2.3462 1.3239 2.2840 1.4877 1.9625 1.7896 1.7151 1.5692 1.4311 1.6156 1.6368 1.8604 1.4491 2.0259 1.3180 1.5524 1.3526 1.7687 2.0590 1.0814 1.1399 1.6017 1.8969 1.4227 2.1583 1.9489 1.6726 1.6657 1.6347 1.3560 1.9519 1.2564 1.2157 6.5921 1.2323 3.5917 1.0589 1.0591 1.0735 1.0787 1.0799 1.0700 1.0646 1.0450 1.0709 1.0777 1.0941 1.0600 3.6753 7.3376 8.1438 7.8958 7.7963 1.0803 1.0590 1.0591 1.0574 1.0384 1.0731 1.0602 1.0644 1.0977 1.0678 1.0431 1.0370 1.1004 1.1030 1.0924 1.0995 1.1044 1.1006 1.0994 1.0997 1.0995 1.0990 1.0912 1.0990 1.0911 1.0918 1.0639 1.0660
irintensity: 0.0981 0.1872 0.4955 1.0918 0.0397 0.6767 1.3267 0.0386 0.2303 0.0074 0.4096 0.8414 1.5554 0.2082 0.7221 0.0628 0.0418 0.5705 0.9217 4.9310 0.5741 0.0345 1.5110 4.7488 0.6139 2.1105 87.7327 22.0022 11.7617 5.1314 2.7490 4.0899 7.3770 4.0493 10.7057 3.5085 2.6182 1.3402 11.6534 20.8291 56.5355 36.5775 25.8295 15.6250 15.2910 46.2416 3.9810 8.8780 1.1199 3.7103 4.5094 15.2938 5.8657 27.5499 0.1791 23.6499 7.2758 16.7242 29.0636 19.3142 9.0240 18.3377 9.8754 12.5905 13.3590 157.1789 47.5224 57.3302 53.8533 11.2503 6.0674 0.1764 90.8461 9.6783 50.5836 75.9350 215.2351 11.8094 15.1140 74.3020 22.1489 1.7824 3.5875 18.0108 43.5305 2.1772 7.6283 21.7268 2.8352 9.5781 21.4087 0.7131 3.7807 2.8740 59.7033 34.0738 17.3598 5.0056 5.6040 14.5683 1.3436 3.2893 9.0071 24.9009 10.6543 10.2657 26.5516 63.6959 5.6757 6.9027 0.0162 0.2671 14.9620 2.8601 9.0170 11.5622 7.4672 1.0113 23.2986 19.5209 32.6591 101.5874 231.4328 165.5804 46.2440 7.6420 11.5892 18.0445 17.0730 40.1749 12.8017 102.9462 17.5799 2.3390 29.7207 42.0075 13.4306 2.8744 8.4177 27.8532 30.2062 72.8374 91.2899 55.3788 7.9998 20.7715 33.3726 16.4696 28.5065 1.5290 3.9187 36.3988 32.1139
temp: 298.150 k
press: 1.00000 atm
elementType: 8 8 8 8 6 6 6 6 6 6 6 6 6 6 6 6 6 6 6 6 6 6 6 6 6 1 1 1 1 1 1 1 1 1 1 1 1 1 1 1 1 1 1 1 1 1 1 1 1 1 1 1 1
symmnumber: 1
zpe: 1169225.6 jmol-1
zpe.correction: 0.445335 hartree
zpe.thermalcorrener: 0.470672 hartree
zpe.thermalcorrenthalpy: 0.471616 hartree
zpe.thermalcorrgfe: 0.389802 hartree
zpe.sumelectzpe: -1116.045810 hartree
zpe.sumelectthermal: -1116.020473 hartree
zpe.sumelectthermalent: -1116.019529 hartree
zpe.sumelectthermalfe: -1116.101343 hartree
dipole: 0.7900 0.8290 1.0520
dipole: 1.5550
quadrupole: -136.5010 -148.7884 -149.5946
quadrupole: -13.7107 -1.6542 -3.3004
quadrupole: 8.4604 -3.8270 -4.6333 -13.7107 -1.6542 -3.3004
hfenergy: -1116.4911448 hartree
pointgroup: C01 [X(C21H28O4)]
dipole: -0.3152324 -0.3377099 0.4010985 debye
polarizability: 337.0049423|-9.431244|231.1081811|6.4450391|4.1721907|169.1429555 unknown
InChI: InChI=1S/C21H28O4/c1-4-5-6-7-13-10-17(22)19-15-12-14(20(23)24)8-9-16(15)21(2,3)25-18(19)11-13/h10-12,15-16,22-23H,4-9H2,1-3H3
charge 0 multiplicity 1
53 atoms
O  0.159119 -2.194826 -0.382289
O  0.028587 2.419107 1.162466
O  6.082913 1.30342 -0.575325
O  4.404939 2.887057 -0.829825
C  2.04313 -1.426922 1.01726
C  1.67301 -2.198601 -0.289766
C  1.556885 0.049622 0.9861
C  3.531937 -1.476065 1.451168
C  0.15845 0.157338 0.381372
C  4.500799 -0.62395 0.595947
C  2.563496 0.994275 0.348236
C  -0.47437 -0.951654 -0.236799
C  2.008238 -3.693628 -0.179076
C  2.187343 -1.610775 -1.620306
C  3.888005 0.702963 0.184992
C  -0.608853 1.342635 0.504684
C  -1.804876 -0.875937 -0.716401
C  -2.54325 0.319635 -0.592763
C  -1.930113 1.441798 0.023036
C  4.746493 1.742145 -0.439568
C  -3.982232 0.402692 -1.080452
C  -5.021556 0.208113 0.058809
C  -6.480025 0.299113 -0.441864
C  -7.522923 0.110911 0.683584
C  -8.978675 0.200348 0.176411
H  1.459793 -1.945373 1.80611
H  1.466721 0.392512 2.042073
H  3.889059 -2.521464 1.491129
H  3.569647 -1.097897 2.49244
H  4.828651 -1.171088 -0.309378
H  5.431258 -0.439081 1.164059
H  2.195325 1.981619 0.045258
H  1.649576 -4.109721 0.778788
H  1.516976 -4.244386 -0.999477
H  3.096937 -3.859689 -0.253421
H  1.791671 -2.217838 -2.453522
H  1.854097 -0.570383 -1.765421
H  3.288081 -1.62932 -1.67136
H  -2.239375 -1.761743 -1.190161
H  -2.48653 2.383792 0.12134
H  -4.16424 1.386502 -1.558189
H  -4.158873 -0.366095 -1.857429
H  -4.849441 0.971541 0.844567
H  -4.851252 -0.776111 0.53945
H  -0.576902 3.198507 1.220803
H  -6.641879 1.283431 -0.93012
H  -6.647812 -0.467348 -1.227524
H  6.607313 2.035238 -0.999254
H  -7.355413 0.87753 1.467643
H  -7.358898 -0.871777 1.170859
H  -9.181684 -0.57675 -0.584589
H  -9.703825 0.064397 0.999803
H  -9.176554 1.184384 -0.289307
