program: Gaussian 09
title: 000107842
version: EM64L-G09RevD.01
frameworkgroup: C1[X(C19H25NO)]
method: RPBEPBE
basis: SDD
operation: Freq
keyword: #p
keyword: freq=noraman
keyword: PBEPBE/SDD
title: #p freq=noraman PBEPBE/SDD
converged: YES YES NO NO
title: Mulliken charges:
elementType: O N C C C C C C C C C C C C C C C C C C C H H H H H H H H H H H H H H H H H H H H H H H H H
charge: -0.467582 -0.377235 0.348058 -0.228923 -0.503666 -0.463165 -0.138741 -0.041032 -0.406012 -0.445153 -0.464858 -0.386182 -0.193002 -0.549877 -0.355139 -0.122903 -0.325804 0.173557 0.171412 -0.485212 -0.483304 0.234519 0.197811 0.227640 0.203316 0.219186 0.222851 0.275319 0.187339 0.207753 0.210068 0.211974 0.204987 0.208876 0.217173 0.214898 0.191113 0.274423 0.227957 0.206464 0.341836 0.229814 0.243669 0.232411 0.277683 0.275679
chargesum: 0.00000
title: Mulliken charges with hydrogens summed into heavy atoms:
elementType: O N C C C C C C C C C C C C C C C C C C C
charge: -0.125746 -0.101915 0.348058 0.005596 -0.078215 -0.040662 0.084110 0.146307 0.011809 -0.028191 -0.038809 0.019830 0.081421 -0.115456 -0.125325 0.120766 -0.093393 0.173557 0.171412 -0.207529 -0.207624
polarizability: 3.07238481e+02 -1.33581121e+01 2.21888517e+02 -4.12584844e+00 -1.08907578e+01 1.58830238e+02
1716.lowfreq: -10.8289 -0.0006 0.0004 0.0007 7.1636 11.3080 25.4488 30.5864 50.5140
frequency: 25.0757 30.5199 50.3993 51.6400 80.5780 90.4285 103.2928 109.1359 124.0245 150.6349 165.5760 178.4678 219.1690 227.1823 247.2809 274.7643 287.1209 295.9186 310.0469 319.4235 320.7809 359.2966 369.3635 401.4868 415.0636 435.0407 443.0319 466.8635 473.0267 501.1849 504.3956 522.0678 570.0399 584.3966 599.1271 600.2952 610.5754 644.8901 647.2547 652.5837 716.3101 753.5890 783.4972 804.5025 837.5205 844.8521 850.2783 866.1132 883.6757 905.1833 912.7577 926.7452 935.6891 955.6462 969.1040 979.5050 983.8847 1006.3443 1011.9800 1024.8626 1044.0392 1062.8727 1072.4202 1078.6295 1085.0220 1100.1819 1110.9326 1116.3370 1130.0375 1138.5921 1150.3441 1171.0009 1190.4445 1208.9963 1215.1306 1224.2466 1244.5189 1258.5182 1264.0304 1280.1158 1284.9121 1288.5252 1291.6662 1297.7513 1307.7496 1317.0492 1331.2668 1334.8024 1336.1948 1340.3753 1347.8336 1350.1756 1354.9723 1359.8773 1378.3608 1446.3757 1447.9272 1456.5552 1461.9913 1467.1113 1472.3344 1473.2239 1512.4362 1625.0513 1640.3678 2117.6813 2118.5851 2834.0910 2948.4654 2958.9409 2971.4092 2972.6142 2976.2776 2976.8259 2979.8537 2991.2540 3008.4924 3021.6348 3032.1929 3035.6923 3038.9891 3042.1853 3049.0050 3052.2434 3080.5612 3087.3796 3100.5961 3109.0301 3401.2978 3427.9271 3428.0743 3557.8678
redmass: 5.2190 5.2002 4.2074 3.3432 2.9907 3.8704 3.1830 3.3227 2.7184 4.6190 3.6392 3.6272 4.8411 2.5363 2.9588 3.1286 3.6828 2.2135 3.1666 1.5277 1.4742 3.1852 3.0478 3.4028 3.1619 2.9883 2.9937 3.3464 2.1819 4.2432 3.2247 3.9448 3.9330 2.3993 1.2430 1.2359 3.1640 1.2263 1.2507 2.7583 2.7593 1.8755 1.9558 2.3633 1.9623 1.6934 1.9618 2.2949 2.1349 2.4061 1.9215 2.4983 2.5482 1.9093 1.1559 1.1691 2.1198 2.7595 2.5651 2.2532 2.1609 2.2139 1.8576 2.2135 2.2200 1.9868 1.7633 2.8797 1.9564 1.6558 1.8374 1.3978 1.5578 1.3341 1.3082 1.4096 1.4635 1.2800 1.3532 1.2421 1.2885 1.3809 1.2811 1.3364 1.3530 1.3631 1.4675 1.3702 1.4122 1.3400 1.4196 1.4738 1.6003 1.5342 1.4774 1.0893 1.0989 1.0893 1.0857 1.1000 1.0961 1.0943 1.2024 6.2447 6.3051 6.3041 6.2987 1.0800 1.0640 1.0751 1.0629 1.0631 1.0697 1.0628 1.0618 1.0635 1.0828 1.0993 1.0960 1.0956 1.0995 1.0987 1.1021 1.1008 1.0890 1.0915 1.0876 1.0877 1.0725 1.1539 1.1540 1.0660
irintensity: 0.0050 0.0354 0.3767 0.1509 0.1770 0.3577 0.3011 1.0441 0.3447 2.0442 1.9629 0.6221 1.5436 0.9605 1.5817 0.8008 3.8904 4.9540 3.5160 48.3017 63.9331 5.3586 5.1835 0.3614 1.1921 0.1127 8.7071 5.7011 8.7264 1.5299 0.2292 1.9695 2.8171 12.6151 69.3169 80.9249 9.5723 63.9157 73.6881 9.8762 36.3467 87.9237 4.1215 3.9918 0.5827 2.5049 7.9510 5.3928 6.6608 25.4782 20.3152 23.4134 20.3249 22.3579 52.6580 32.6530 26.8111 12.9646 4.9085 5.2236 6.0711 4.4434 54.8240 16.9975 1.4205 2.6534 14.1406 8.3370 17.1951 15.5953 15.7306 1.2958 17.3893 20.7350 8.9220 10.7531 6.9687 4.5978 8.3055 7.2677 2.0551 24.3869 1.1225 1.3607 18.7017 1.9164 8.4173 26.9447 0.9229 10.4218 14.2166 8.9675 4.3490 5.5077 1.9036 4.4015 14.9808 2.3827 19.9301 3.6271 34.4144 3.6288 39.5809 15.5116 6.8311 25.6952 13.6219 52.5017 27.4471 14.1861 19.5867 22.7339 100.3139 12.3917 40.8961 39.7974 17.9439 46.8732 45.8116 18.4805 35.2670 19.6687 58.3511 84.8313 11.1334 2.6876 30.6834 20.2690 14.6744 132.1996 61.9966 2.8581
temp: 298.150 k
press: 1.00000 atm
elementType: 8 7 6 6 6 6 6 6 6 6 6 6 6 6 6 6 6 6 6 6 6 1 1 1 1 1 1 1 1 1 1 1 1 1 1 1 1 1 1 1 1 1 1 1 1 1
symmnumber: 1
zpe: 1021634.5 jmol-1
zpe.correction: 0.389120 hartree
zpe.thermalcorrener: 0.410929 hartree
zpe.thermalcorrenthalpy: 0.411873 hartree
zpe.thermalcorrgfe: 0.338192 hartree
zpe.sumelectzpe: -867.238972 hartree
zpe.sumelectthermal: -867.217163 hartree
zpe.sumelectthermalent: -867.216218 hartree
zpe.sumelectthermalfe: -867.289900 hartree
dipole: -2.4869 -1.9618 -1.0542
dipole: 3.3383
quadrupole: -130.9497 -121.4499 -123.7819
quadrupole: 5.8089 0.3066 3.9339
quadrupole: -5.5559 3.9439 1.6119 5.8089 0.3066 3.9339
hfenergy: -867.6280916 hartree
pointgroup: C01 [X(C19H25N1O1)]
dipole: -0.9721785 0.7765476 0.4205491 debye
polarizability: 307.487484|12.0653376|221.9903024|6.2616928|-9.2638587|158.4794498 unknown
InChI: InChI=1S/C19H25NO/c1-3-5-7-10-16-11-8-14-19(20-16)15-9-13-18(21)17(19)12-6-4-2/h1-2,5-7,12,16-18,20-21H,8-11,13-15H2
charge 0 multiplicity 1
46 atoms
O  -0.719265 1.963778 1.898802
N  0.411727 1.196072 -0.635412
C  -0.964652 0.670753 -0.882591
C  -1.663541 0.209578 0.479814
C  -1.803422 1.803126 -1.543708
C  -0.859706 -0.503889 -1.893209
C  -2.013717 1.421612 1.39689
C  1.446392 0.212445 -0.216422
C  -2.107903 2.996556 -0.610452
C  0.173942 -1.575661 -1.485583
C  -2.818046 2.523857 0.677111
C  1.552525 -0.918966 -1.257878
C  -2.907007 -0.620068 0.261508
C  2.785722 0.980347 -0.038578
C  -3.076466 -1.886747 0.751474
C  3.873517 0.142811 0.586244
C  5.097159 -0.088449 0.020968
C  -4.246381 -2.687954 0.556633
C  6.137959 -0.872063 0.617163
C  -5.237375 -3.41653 0.417611
C  7.068649 -1.537687 1.089542
H  -0.937074 -0.401672 1.050179
H  -2.760134 1.372503 -1.904991
H  -1.24588 2.150258 -2.432907
H  -0.554948 -0.071622 -2.867403
H  -1.857502 -0.960353 -2.033478
H  -2.593166 1.041992 2.264745
H  0.36415 1.950303 0.067512
H  1.199097 -0.254983 0.772007
H  -2.741726 3.732535 -1.140598
H  -1.169162 3.522163 -0.348712
H  0.241138 -2.350661 -2.272696
H  -0.153376 -2.094255 -0.561621
H  -2.985586 3.3733 1.370162
H  -3.820871 2.123109 0.426837
H  2.296832 -1.664171 -0.919831
H  1.918065 -0.48706 -2.211625
H  -3.725063 -0.17639 -0.323489
H  3.102892 1.379917 -1.020062
H  2.585395 1.853798 0.619879
H  -0.915695 2.671612 2.563301
H  -2.264743 -2.341319 1.339799
H  3.654225 -0.302609 1.568274
H  5.318419 0.352438 -0.962409
H  -6.1007 -4.043255 0.289935
H  7.870102 -2.1151 1.512165
