program: Gaussian 09
title: 000107845
version: EM64L-G09RevD.01
frameworkgroup: C1[X(C20H24O3)]
method: RPBEPBE
basis: SDD
operation: Freq
keyword: #pfreq=noraman
keyword: PBEPBE/SDD
title: #p freq=noraman PBEPBE/SDD
converged: YES YES NO NO
title: Mulliken charges:
elementType: O O O C C C C C C C C C C C C C C C C C C C C H H H H H H H H H H H H H H H H H H H H H H H H
charge: -0.276771 -0.241969 -0.233345 -0.147446 0.250948 -0.238030 -0.097222 -0.539893 -0.454738 0.269980 -0.480698 -0.284818 -0.775477 -0.366809 0.095229 -0.604948 0.394209 -0.544475 -0.528857 -0.524240 0.276243 0.158383 -0.760374 0.245744 0.242593 0.272523 0.217958 0.227065 0.222566 0.243516 0.223945 0.220212 0.242438 0.224127 0.230842 0.244106 0.211161 0.223178 0.236739 0.233784 0.218004 0.254861 0.232500 0.245480 0.247200 0.246772 0.247803
chargesum: 0.00000
title: Mulliken charges with hydrogens summed into heavy atoms:
elementType: O O O C C C C C C C C C C C C C C C C C C C C
charge: -0.276771 -0.241969 -0.233345 0.098298 0.250948 0.004563 0.175302 -0.094870 0.011345 0.269980 -0.036541 -0.042380 -0.076403 -0.155648 0.095229 -0.145031 0.394209 -0.092687 -0.273996 -0.046260 0.276243 0.158383 -0.018599
polarizability: 4.02641128e+02 3.41387339e+00 1.93782911e+02 -1.77520324e+01 -4.24024640e-01 1.52841013e+02
1716.lowfreq: -25.9663 -0.0005 0.0003 0.0005 3.2510 7.4405 9.9311 23.8634 34.6567
frequency: -25.8876 23.5844 34.5993 53.3643 61.6131 73.1085 109.9025 135.9021 153.5698 155.5324 165.1098 193.2894 204.5822 217.2558 234.5805 259.3558 268.2653 274.8550 301.8078 335.9897 360.0335 384.6666 416.2113 418.4929 426.0752 465.8486 484.0460 503.9483 525.2843 533.1321 540.9042 569.4817 581.8194 592.7420 602.8308 641.0204 645.6758 683.0061 695.4783 733.4555 772.6095 778.3779 784.3711 812.4965 852.3301 861.7573 867.4984 871.2572 887.1961 913.7072 951.5802 957.8186 967.3774 971.1381 981.1485 997.5563 1010.2639 1012.7176 1020.8989 1034.1402 1040.8347 1045.6599 1056.0157 1062.6505 1099.2908 1110.8206 1126.3504 1147.4032 1156.2230 1160.4567 1176.5100 1181.3686 1197.9322 1199.5147 1210.5887 1213.8472 1228.6133 1242.2292 1249.7788 1254.2371 1271.5357 1277.9443 1282.3913 1288.3214 1299.6868 1310.5437 1325.0565 1329.6434 1339.2786 1347.7854 1353.2967 1372.5133 1381.9827 1385.5917 1392.2222 1402.3236 1443.3685 1452.8623 1455.2934 1456.4879 1458.1132 1463.8821 1468.7623 1477.2387 1481.1445 1491.0500 1548.6660 1573.5633 1581.4467 1603.0673 1649.7556 2924.7861 2945.2970 2958.3831 2962.5627 2981.0639 2982.3423 2993.4020 2997.0823 3007.2556 3022.4339 3024.0893 3045.3067 3048.5617 3059.3240 3063.9061 3070.1747 3088.1976 3093.9065 3095.0186 3097.1243 3106.5771 3129.5777 3142.7709 3144.9703
redmass: 1.0896 6.8621 6.5998 3.6539 4.0050 3.4173 2.7474 3.4511 2.5693 3.7388 3.7893 5.1890 2.1424 1.9337 1.6514 3.5748 2.7004 2.7393 3.0604 3.6933 3.9889 2.7383 3.7138 3.2037 3.5833 4.2590 3.6156 3.4348 2.7736 4.3324 3.2735 3.1697 3.3458 4.2527 2.8488 3.2729 3.9449 3.4106 3.0859 2.4483 2.2036 2.5432 2.3179 2.2565 2.0585 2.1678 2.8414 2.2514 1.7114 2.1144 1.9482 2.0416 1.7659 1.7644 2.4511 2.1814 2.0844 2.3780 2.3469 2.5503 1.6743 2.3775 2.3309 2.1211 2.6594 2.0658 1.7294 1.7616 1.2796 2.0675 1.6597 1.7697 1.9449 2.0805 1.5479 1.5217 1.5470 1.5966 1.4331 1.4704 1.5686 1.6425 1.5990 1.4971 1.3732 1.7663 1.4869 1.4480 1.3642 1.4989 1.5103 1.4828 1.2468 1.2658 3.8377 1.6813 1.0887 1.0630 1.0472 1.0900 1.0926 1.0632 1.0948 1.0730 1.0680 1.0804 8.8526 8.0357 7.5516 7.4893 9.3926 1.0786 1.0835 1.0668 1.0693 1.0640 1.0605 1.0408 1.0569 1.0368 1.0832 1.0653 1.0963 1.1002 1.1013 1.0915 1.0964 1.0998 1.1022 1.0974 1.0993 1.0867 1.0911 1.1009 1.0936
irintensity: 1.5001 1.6641 1.4287 0.5859 2.4846 1.0151 0.8920 4.6451 0.5329 2.8222 2.6202 0.3082 0.0844 0.8075 0.3581 9.6926 5.9040 2.2903 2.6127 0.0826 5.8316 7.8023 0.2339 0.3934 3.0050 0.5179 3.7483 3.2156 2.5958 5.0788 6.4339 3.7642 3.2780 5.6813 0.3244 0.2139 6.4065 4.9938 8.3624 2.7900 14.0779 6.4026 18.8457 0.3588 11.0802 1.3892 6.0945 26.5398 13.0589 8.5336 3.4838 23.1667 20.3347 72.4873 2.0231 184.8333 8.3189 30.5528 10.6488 14.9311 8.7026 10.5335 21.7442 2.7782 4.5790 2.1841 0.8070 4.0374 4.9710 0.2330 2.0037 16.0574 76.3709 340.1173 36.6224 86.4710 32.0830 13.1271 14.3405 2.6434 38.6451 23.5446 14.0540 1.9699 6.9093 5.2156 2.3771 2.1791 2.9881 3.9769 3.4410 7.4389 49.2839 27.4023 22.8479 3.2756 12.6394 26.6076 18.7881 12.5076 6.1674 10.9977 8.7146 2.7370 2.2836 13.3816 48.8472 52.8982 417.9943 61.3181 191.0962 1.0956 24.4488 18.0075 18.4435 18.7799 33.4809 15.9476 34.9913 2.7284 2.6173 43.5746 42.4726 28.4785 16.8209 19.6483 21.3654 46.9694 24.2818 8.8184 20.4484 3.4983 7.1271 12.5093 28.0550
temp: 298.150 k
press: 1.00000 atm
elementType: 8 8 8 6 6 6 6 6 6 6 6 6 6 6 6 6 6 6 6 6 6 6 6 1 1 1 1 1 1 1 1 1 1 1 1 1 1 1 1 1 1 1 1 1 1 1 1
symmnumber: 1
zpe: 1031635.1 jmol-1
zpe.correction: 0.392929 hartree
zpe.thermalcorrener: 0.413416 hartree
zpe.thermalcorrenthalpy: 0.414361 hartree
zpe.thermalcorrgfe: 0.343529 hartree
zpe.sumelectzpe: -1000.485384 hartree
zpe.sumelectthermal: -1000.464896 hartree
zpe.sumelectthermalent: -1000.463952 hartree
zpe.sumelectthermalfe: -1000.534784 hartree
dipole: -5.3883 1.0096 2.6128
dipole: 6.0729
quadrupole: -184.6420 -124.8522 -141.5332
quadrupole: 7.1977 -7.7042 -1.6899
quadrupole: -34.2995 25.4903 8.8093 7.1977 -7.7042 -1.6899
hfenergy: -1000.8783126 hartree
pointgroup: C01 [X(C20H24O3)]
dipole: 2.1262227 -0.3206569 1.0415764 debye
polarizability: 402.7206626|5.7446552|193.7424848|16.4843859|-2.0039059|152.8019048 unknown
InChI: InChI=1S/C20H24O3/c1-12(21)23-19-8-7-18-17-5-3-13-11-14(22)4-6-15(13)16(17)9-10-20(18,19)2/h9-11,17-19H,3-8H2,1-2H3
charge 0 multiplicity 1
47 atoms
O  4.307539 0.552617 0.260133
O  5.419845 0.547212 -1.793031
O  -6.659443 0.687905 -0.557719
C  0.953996 -0.980107 -0.187717
C  1.858811 0.098135 0.487985
C  -0.438878 -1.048167 0.464596
C  3.126804 -0.086877 -0.385158
C  1.86132 -2.234084 -0.257955
C  3.285229 -1.63392 -0.537979
C  -1.110049 0.337835 0.341581
C  -1.330414 -2.170079 -0.103715
C  1.152738 1.432218 0.411379
C  2.187133 -0.200722 1.983578
C  -0.218072 1.506071 0.36148
C  -2.493373 0.463064 0.214574
C  -2.736797 -2.07537 0.522477
C  -3.364142 -0.721103 0.231852
C  -3.21261 1.811012 0.146435
C  -4.728181 -0.623985 0.011764
C  -4.473078 1.78399 -0.748969
C  5.40166 0.825273 -0.573157
C  -5.398039 0.613467 -0.411359
C  6.511753 1.485819 0.215571
H  0.795345 -0.63824 -1.235149
H  -0.302498 -1.260339 1.548786
H  2.995949 0.387135 -1.375907
H  1.545319 -2.932254 -1.052069
H  1.84582 -2.79368 0.696286
H  4.028899 -2.001016 0.192111
H  3.658886 -1.886448 -1.543596
H  -0.879825 -3.156018 0.116012
H  -1.401148 -2.074743 -1.205709
H  1.75368 2.350435 0.453678
H  1.270885 -0.193673 2.59813
H  2.689417 -1.176198 2.109104
H  2.865649 0.5751 2.37616
H  -0.674754 2.50141 0.342218
H  -2.643596 -2.207209 1.621567
H  -3.395601 -2.883727 0.158238
H  -3.521474 2.089829 1.176212
H  -2.543691 2.61165 -0.20886
H  -5.366418 -1.512219 0.098339
H  -4.176028 1.675167 -1.812453
H  -5.042783 2.725723 -0.665278
H  6.836034 0.827339 1.039985
H  6.150682 2.425078 0.669155
H  7.362702 1.696994 -0.447607
