program: Gaussian 09
title: 000107904
version: EM64L-G09RevD.01
frameworkgroup: C1[X(C18H20N2O6)]
method: RPBEPBE
basis: SDD
operation: Freq
keyword: #p
keyword: freq=noraman
keyword: PBEPBE/SDD
title: #p freq=noraman PBEPBE/SDD
converged: YES YES NO NO
title: Mulliken charges:
elementType: O O O O O O N N C C C C C C C C C C C C C C C C C C H H H H H H H H H H H H H H H H H H H H
charge: -0.416355 -0.417259 -0.374811 -0.381223 -0.371134 -0.369958 -0.571122 -0.549988 0.216263 0.218067 0.538227 0.525053 -0.607774 -0.600527 -0.535548 -0.536666 -0.203615 -0.210779 0.136830 0.136080 -0.442648 -0.445710 -0.384403 -0.384254 0.284850 0.248951 0.227511 0.212918 0.227087 0.242014 0.264603 0.269626 0.263784 0.271366 0.230330 0.235428 0.212727 0.212983 0.280418 0.287911 0.284572 0.282924 0.350805 0.350853 0.396725 0.394871
chargesum: 0.00000
title: Mulliken charges with hydrogens summed into heavy atoms:
elementType: O O O O O O N N C C C C C C C C C C C C C C C C C C
charge: -0.065550 -0.066406 0.021914 0.013648 -0.371134 -0.369958 -0.002793 0.017508 0.216263 0.218067 0.538227 0.525053 -0.167346 -0.131425 -0.270946 -0.267040 0.060168 0.060588 0.136830 0.136080 -0.212318 -0.210283 -0.171676 -0.171270 0.284850 0.248951
polarizability: 2.96128863e+02 1.08249106e+00 2.47223251e+02 7.05471171e+00 2.12491219e+00 1.59671049e+02
1716.lowfreq: -7.1831 -0.9748 -0.0013 -0.0011 -0.0009 1.8742 33.7250 49.9724 61.8524
frequency: 33.6939 49.9381 61.8472 72.3018 74.0521 89.5976 103.5250 111.3941 126.1933 130.0638 150.0644 154.8702 161.7872 194.5359 201.2161 227.3547 244.8296 251.1995 259.1986 278.6871 281.3420 304.3849 322.1966 326.4491 335.2062 342.0585 353.2771 360.7153 371.7704 383.8734 428.7033 446.2918 472.2525 486.6867 500.9986 507.2773 524.0212 545.3325 560.3126 587.4517 618.5719 630.0470 639.4413 641.3659 648.4517 704.1533 725.9374 730.9355 741.2916 749.3866 779.4776 780.7081 797.0109 801.7223 809.3680 816.3713 838.0763 906.4977 910.8872 929.4274 933.0740 936.7698 949.8245 968.1468 991.8609 995.2745 1038.8978 1079.7892 1087.3919 1092.4888 1109.5356 1129.0913 1134.8635 1149.6798 1160.0083 1162.2512 1169.8480 1182.1638 1188.7294 1200.5726 1215.3145 1234.6199 1242.5385 1249.7403 1253.6448 1281.5816 1294.0312 1302.8567 1308.3167 1310.6240 1315.0425 1326.0958 1349.0996 1373.1607 1384.5662 1385.1672 1401.6416 1406.0480 1416.0148 1456.4866 1461.8776 1473.0223 1495.9678 1507.6460 1567.2123 1600.5250 1601.0755 1605.0173 1613.3496 1616.9710 1630.8727 1638.0440 2231.7520 2443.5697 2985.8475 2991.2681 3044.1644 3058.1622 3068.6830 3073.4525 3105.8259 3107.3278 3132.1206 3135.7777 3137.1428 3144.5546 3447.5532 3479.0626 3576.0760 3576.2283 3577.5342 3617.2398
redmass: 5.0627 6.4799 4.5825 5.5010 6.0437 5.6676 5.1697 6.0901 8.0777 5.3213 5.8547 5.3174 6.7358 5.4918 6.0839 1.3772 2.3124 3.5535 3.7356 2.7560 3.6498 2.1616 1.6955 2.0275 2.2981 1.1433 2.9784 4.7769 5.2296 4.1314 3.3878 4.2981 3.9543 4.0366 2.9150 4.1691 2.2584 3.6119 3.1508 3.7349 2.5689 2.1463 4.0091 6.1695 3.1960 5.7475 5.9034 5.5984 4.0136 4.9482 3.2548 4.5269 2.2549 2.1044 2.2266 3.2209 4.7294 1.7836 1.4836 1.8281 1.4075 1.4350 1.8180 2.0468 2.8774 4.4631 2.9855 2.0469 2.1311 2.4460 1.6904 1.4434 1.3226 1.1152 1.2682 1.2267 1.3076 1.2430 1.5592 1.4347 2.0941 2.2469 2.8765 2.3155 2.2190 1.7673 1.3712 1.3912 1.7796 1.4293 1.4375 1.7018 1.4488 1.7332 6.0730 6.0095 2.2980 2.8592 3.5725 1.1031 1.1002 1.5107 2.9119 3.3608 5.5913 3.4277 2.1118 5.7142 6.6720 6.6496 1.2260 1.0930 1.1398 1.0731 1.0592 1.0626 1.0999 1.0906 1.0904 1.0955 1.0873 1.0875 1.0944 1.0954 1.0931 1.0917 1.0447 1.0443 1.0660 1.0660 1.0980 1.0994
irintensity: 0.0841 0.9996 5.4798 1.5252 1.0934 2.1656 1.6823 1.7827 6.9776 2.1234 3.1251 2.2072 0.1634 2.6233 4.2648 86.5951 21.6945 6.3731 2.7205 39.8140 15.0047 16.9363 62.8372 71.9289 39.2030 43.2567 4.6251 11.5850 5.1053 61.1890 1.1570 7.8782 2.4534 10.8909 2.1986 62.3314 116.7447 99.5151 122.1216 33.9022 76.5237 105.6984 10.3388 6.2100 99.9379 1.4349 23.4718 1.8481 1.8885 13.8267 3.7615 24.4128 6.8509 42.1427 14.5012 17.6759 2.7270 0.0356 7.1490 3.0425 1.6918 2.6381 19.3261 13.5515 17.4660 23.5718 8.7906 133.1208 32.1113 65.0854 46.3370 13.8307 30.4401 80.8806 42.1309 52.7633 274.9593 53.0605 6.0522 69.5982 19.5552 69.0614 17.4027 64.5769 77.5448 108.1412 22.5735 47.6757 3.4074 3.2870 11.8107 22.1033 8.3469 12.1137 4.3562 15.6959 19.1724 19.3924 34.8315 14.6024 15.2203 103.9738 55.8417 85.8020 460.2092 1.9218 10.4014 9.5025 8.0265 2.2506 45.6361 42.0860 10.7752 3601.3695 38.4146 21.7513 8.2533 5.3323 15.9022 15.3455 16.9927 18.2547 31.3786 20.7435 4.3942 0.7625 3.2811 7.5970 32.6812 31.8158 3.9597 7.5280
temp: 298.150 k
press: 1.00000 atm
elementType: 8 8 8 8 8 8 7 7 6 6 6 6 6 6 6 6 6 6 6 6 6 6 6 6 6 6 1 1 1 1 1 1 1 1 1 1 1 1 1 1 1 1 1 1 1 1
symmnumber: 1
zpe: 936244.5 jmol-1
zpe.correction: 0.356597 hartree
zpe.thermalcorrener: 0.381237 hartree
zpe.thermalcorrenthalpy: 0.382182 hartree
zpe.thermalcorrgfe: 0.303834 hartree
zpe.sumelectzpe: -1256.885980 hartree
zpe.sumelectthermal: -1256.861339 hartree
zpe.sumelectthermalent: -1256.860395 hartree
zpe.sumelectthermalfe: -1256.938743 hartree
dipole: 1.3751 1.8825 -0.6578
dipole: 2.4223
quadrupole: -125.6410 -135.2964 -152.4441
quadrupole: 1.3157 4.7903 2.4684
quadrupole: 12.1528 2.4974 -14.6502 1.3157 4.7903 2.4684
hfenergy: -1257.2425765 hartree
pointgroup: C01 [X(C18H20N2O6)]
dipole: -0.5278773 0.7556667 0.2419463 debye
polarizability: 294.6675406|-3.0147109|247.4346658|14.98434|-0.9300012|160.9209569 unknown
InChI: InChI=1S/C18H20N2O6/c19-13(17(23)24)7-9-1-3-15(21)11(5-9)12-6-10(2-4-16(12)22)8-14(20)18(25)26/h1-6,13-14,21-23,25H,7-8,19-20H2
charge 0 multiplicity 1
46 atoms
O  -0.415061 3.950621 -1.334827
O  0.847982 3.820599 1.479087
O  -1.350611 -2.216178 -1.399414
O  1.079562 -2.50437 1.217995
O  -1.439786 -2.509617 0.893627
O  1.149421 -2.523719 -1.096093
N  -4.252874 -2.904276 0.223924
N  4.020231 -3.24065 -0.407438
C  -0.629439 1.890863 -0.095405
C  0.840588 1.806765 0.148373
C  -2.836579 0.753687 0.088463
C  2.910811 0.44538 -0.091832
C  -3.651608 -0.43992 0.565905
C  3.599525 -0.805903 -0.620425
C  -1.448355 0.832705 0.363487
C  1.541125 0.688407 -0.361375
C  -3.457916 -1.767408 -0.265183
C  3.236987 -2.11785 0.142143
C  -1.244913 2.931005 -0.841908
C  1.563482 2.740511 0.937375
C  -3.419269 1.809962 -0.653755
C  3.603698 1.399111 0.692853
C  -2.634787 2.893009 -1.107789
C  2.941222 2.541018 1.194916
C  -1.993665 -2.202979 -0.224173
C  1.72758 -2.391432 0.044482
H  -3.401447 -0.686557 1.616226
H  -4.732874 -0.206743 0.528279
H  3.345089 -0.963711 -1.687291
H  4.697405 -0.710863 -0.550098
H  -0.976519 0.056521 0.976801
H  0.989344 0.000735 -1.01105
H  -3.71388 -1.580343 -1.321519
H  3.479949 -2.003229 1.211745
H  -4.492762 1.792497 -0.878218
H  4.667768 1.253183 0.914181
H  -3.102106 3.702494 -1.684637
H  3.493701 3.269113 1.803979
H  -5.250134 -2.863954 0.005212
H  -4.047243 -3.176386 1.189296
H  3.81304 -3.43287 -1.394249
H  4.003122 -4.08994 0.166458
H  -0.949057 4.630586 -1.815937
H  1.451953 4.416748 1.987834
H  -0.307478 -2.433408 -1.315636
H  0.02038 -2.601012 1.115515
