program: Gaussian 09
title: 000008811
version: EM64L-G09RevD.01
frameworkgroup: C1[X(C16H16N4)]
method: RPBEPBE
basis: SDD
operation: Freq
keyword: #pfreq=noraman
keyword: PBEPBE/SDD
title: #p freq=noraman PBEPBE/SDD
converged: YES YES NO NO
title: Mulliken charges:
elementType: N N N N C C C C C C C C C C C C C C C C H H H H H H H H H H H H H H H H
charge: -0.657739 -0.657793 -0.373464 -0.373586 0.530343 0.530277 -0.329226 -0.329234 0.346346 0.346336 -0.417080 -0.417176 -0.415825 -0.415834 -0.376474 -0.376236 -0.380319 -0.380321 0.066791 0.066944 0.217691 0.217683 0.223199 0.223215 0.227683 0.227694 0.215187 0.214982 0.284252 0.284340 0.313397 0.314460 0.313411 0.314448 0.210809 0.210819
chargesum: 0.00000
title: Mulliken charges with hydrogens summed into heavy atoms:
elementType: N N N N C C C C C C C C C C C C C C C C
charge: -0.029882 -0.029934 -0.162654 -0.162766 0.530343 0.530277 -0.111535 -0.111551 0.346346 0.346336 -0.193882 -0.193961 -0.188142 -0.188140 -0.161288 -0.161255 -0.096067 -0.095981 0.066791 0.066944
polarizability: 5.36416371e+02 -1.96315055e+01 1.98585748e+02 1.71696147e-02 -1.57906003e-03 8.46290815e+01
1716.lowfreq: -2.3837 -0.0003 0.0003 0.0008 4.3445 11.2131 23.9995 26.0563 44.1598
frequency: 23.9965 26.0451 44.1475 58.1001 62.9793 63.7316 131.4370 145.6052 152.6117 178.3813 215.6300 278.1040 284.7783 323.3304 346.4611 400.8539 403.9887 418.9242 420.3164 430.9447 434.0931 445.9054 449.8843 475.5840 480.4196 508.8035 533.4850 545.0750 582.9198 632.4868 635.6785 649.4272 652.5896 704.9087 738.7309 743.8879 763.8486 808.8905 810.6434 826.2515 835.8311 837.2710 844.9421 867.3673 874.2608 908.5120 957.3628 961.8686 983.1738 997.4527 1000.3517 1008.1025 1008.1984 1034.6422 1034.9100 1071.5480 1071.9927 1118.4379 1121.9406 1138.4257 1143.0915 1197.0821 1199.0048 1209.5356 1250.8913 1295.5202 1303.1399 1315.4244 1328.4697 1367.0813 1375.0413 1384.5581 1391.9190 1419.2806 1422.5741 1501.4453 1514.8353 1554.5831 1560.3061 1596.0066 1596.4951 1607.9448 1622.9722 1634.8897 1635.1113 1645.9251 3089.7051 3100.1689 3119.0998 3119.1642 3122.4941 3122.8753 3147.4286 3147.4811 3169.2501 3169.2981 3324.6935 3324.7969 3537.1765 3537.2835 3681.5900 3681.6748
redmass: 3.9881 5.8663 5.4532 5.1388 4.0783 4.2487 5.3682 5.4625 2.6485 6.8146 4.3063 2.8741 4.1490 3.7954 5.0448 2.1264 2.0488 1.9459 1.3860 1.9320 3.5053 1.3421 1.2109 2.4481 4.5060 3.1604 3.0002 3.6129 3.3372 6.4439 5.2637 3.6062 2.9108 4.1893 4.4468 3.3208 3.9474 1.3776 1.3667 4.4583 1.3809 1.5419 1.4033 1.8148 2.8669 2.0490 1.3630 1.4091 1.1870 1.4480 1.4448 2.5968 2.7900 1.8402 1.8035 1.5308 1.5277 1.4550 1.4384 2.3743 2.0922 1.1534 1.4241 1.7567 1.3584 2.5761 1.4074 1.4625 1.4144 3.4618 2.9672 3.7425 4.1971 3.9555 3.4876 2.6618 2.8869 6.5141 5.9203 3.3990 3.4647 5.5441 6.0507 1.3804 1.3666 5.4310 1.0917 1.0860 1.0871 1.0870 1.0899 1.0895 1.0951 1.0953 1.0946 1.0946 1.0761 1.0761 1.0450 1.0450 1.1034 1.1034
irintensity: 7.3762 0.0031 2.5741 0.7487 13.3232 1.0833 0.1102 1.5984 1.8465 0.0021 15.1353 2.4187 4.8278 7.5041 27.3815 26.5848 4.9098 127.7065 41.9178 43.1203 27.0457 75.3264 261.7631 1.6127 9.9461 0.3476 28.4605 48.8358 0.0070 0.0091 0.3107 8.4821 10.0797 36.0599 0.8418 1.8730 4.2477 23.6486 93.5912 2.3318 72.0471 2.1063 3.2296 70.1338 33.0905 1.5780 17.8157 0.0260 52.5205 16.8635 4.3545 0.2533 11.4856 1.9384 7.4674 323.2120 2.6300 19.0286 0.0001 3.0956 71.8721 7.4833 0.7415 0.0529 10.0273 2.4706 0.0045 3.0055 0.1339 6.5688 212.2067 16.6536 141.6929 0.2848 44.1838 2.1238 51.8171 0.9287 51.1507 242.0539 1.8492 0.0533 46.5753 342.1219 45.2188 0.0356 0.0057 49.3519 37.5366 5.8843 0.0483 28.1491 0.6793 33.8933 2.7253 0.2281 43.2071 21.8047 23.0351 18.0432 20.9865 18.3168
temp: 298.150 k
press: 1.00000 atm
elementType: 7 7 7 7 6 6 6 6 6 6 6 6 6 6 6 6 6 6 6 6 1 1 1 1 1 1 1 1 1 1 1 1 1 1 1 1
symmnumber: 1
zpe: 753514.5 jmol-1
zpe.correction: 0.286999 hartree
zpe.thermalcorrener: 0.305393 hartree
zpe.thermalcorrenthalpy: 0.306337 hartree
zpe.thermalcorrgfe: 0.238639 hartree
zpe.sumelectzpe: -836.894155 hartree
zpe.sumelectthermal: -836.875761 hartree
zpe.sumelectthermalent: -836.874816 hartree
zpe.sumelectthermalfe: -836.942515 hartree
dipole: -0.0009 0.0022 2.5850
dipole: 2.5850
quadrupole: -82.2557 -105.1825 -127.4607
quadrupole: 42.9846 -0.0297 0.0081
quadrupole: 22.7106 -0.2162 -22.4944 42.9846 -0.0297 0.0081
hfenergy: -837.1811534 hartree
pointgroup: C01 [X(C16H16N4)]
dipole: 0.0016362 -0.0018167 -1.0170082 debye
polarizability: 536.8984636|14.9025814|198.1022321|0.5440272|-0.2769069|84.6305047 unknown
InChI: InChI=1S/C16H16N4/c17-15(18)13-7-3-11(4-8-13)1-2-12-5-9-14(10-6-12)16(19)20/h1-10,17,19H,18,20H2
charge 0 multiplicity 1
36 atoms
N  6.822883 -1.356618 -0.294221
N  -6.820961 1.355201 -0.31776
N  6.999232 0.949495 0.422763
N  -6.999492 -0.948171 0.407146
C  1.940583 0.271642 0.102299
C  -1.939804 -0.271797 0.100793
C  0.486698 0.483701 0.097368
C  -0.485901 -0.48403 0.10096
C  4.800168 -0.014734 0.095996
C  -4.799355 0.014928 0.084238
C  2.551802 -1.015684 0.152083
C  -2.551014 1.015845 0.142035
C  2.803444 1.408066 0.065444
C  -2.802716 -1.40829 0.067758
C  3.951189 -1.154717 0.148872
C  -3.950373 1.155047 0.133744
C  4.201096 1.270727 0.063783
C  -4.200323 -1.270761 0.060968
C  6.295617 -0.114991 0.08267
C  -6.29477 0.115115 0.065546
H  0.178688 1.539146 0.086549
H  -0.177971 -1.539557 0.100573
H  1.93014 -1.915738 0.207756
H  -1.929409 1.916072 0.195388
H  2.359567 2.410967 0.035678
H  -2.358924 -2.411406 0.044896
H  4.377086 -2.161741 0.234581
H  -4.376206 2.162635 0.212941
H  4.865231 2.139914 0.04581
H  -4.864607 -2.139885 0.045645
H  7.829352 -1.506837 -0.284051
H  6.238906 -2.08106 -0.705172
H  -7.82749 1.50522 -0.311576
H  -6.235731 2.078544 -0.728832
H  8.028104 0.803392 0.358988
H  -8.028142 -0.802339 0.339439
