program: Gaussian 09
title: 000107841
version: EM64L-G09RevD.01
frameworkgroup: C1[X(C22H27N3O3S)]
method: RPBEPBE
basis: SDD
operation: Freq
keyword: #p
keyword: freq=noraman
keyword: PBEPBE/SDD
title: #p freq=noraman PBEPBE/SDD
converged: YES YES NO NO
title: Mulliken charges:
elementType: S O O O N N N C C C C C C C C C C C C C C C C C C C C C C H H H H H H H H H H H H H H H H H H H H H H H H H H H
charge: 0.252425 -0.240966 -0.311405 -0.269383 -0.087611 -0.358327 -0.473017 -0.388752 -0.493659 0.158914 0.567664 0.490686 -0.387434 -0.311002 -0.432240 -0.341805 -0.558457 -0.304145 -0.684612 -0.700515 -0.249303 0.531785 -0.264406 -0.398735 -0.232394 -0.240065 0.261236 -0.214610 -0.672572 0.217400 0.238109 0.269562 0.217257 0.216694 0.218295 0.201472 0.189663 0.250038 0.276351 0.218815 0.214835 0.227659 0.211214 0.216472 0.226089 0.251351 0.250392 0.307835 0.231931 0.232532 0.333353 0.230417 0.230394 0.229970 0.229965 0.214639
chargesum: 0.00000
title: Mulliken charges with hydrogens summed into heavy atoms:
elementType: S O O O N N N C C C C C C C C C C C C C C C C C C C C C C
charge: 0.252425 -0.240966 -0.311405 -0.269383 -0.087611 -0.358327 -0.139664 0.066758 -0.006840 0.158914 0.567664 0.490686 0.047556 0.080133 -0.432240 -0.341805 -0.308419 -0.027794 -0.023303 -0.046740 0.002048 0.531785 -0.014014 -0.090901 -0.000463 -0.007533 0.261236 0.246201 0.002002
polarizability: 3.86326209e+02 -4.68271485e+01 2.79644762e+02 -1.82668134e+01 -2.45874293e+01 2.51436531e+02
1716.lowfreq: -9.1754 -0.0009 -0.0007 0.0011 3.2356 3.9133 9.6558 19.8753 20.9643
frequency: 6.6724 19.6637 20.9177 27.1889 37.8656 50.1951 55.3494 59.3720 64.4277 74.5630 80.3559 88.1129 102.7229 119.9658 130.2049 145.3133 160.0046 170.0556 188.7368 203.9020 218.3916 226.5909 247.5456 254.6046 263.9427 271.3879 281.6756 308.9449 324.9554 345.6116 353.7916 369.9487 382.4553 392.1584 401.2331 420.5753 443.0402 459.7546 462.7848 477.9958 494.1004 520.1428 542.9048 559.4788 614.6386 632.2307 644.5951 656.6941 663.0065 672.4974 701.7394 703.3974 715.3546 724.0618 731.5436 756.6075 769.6362 772.3532 785.8620 800.7640 806.0004 823.0042 842.4461 857.3122 870.3640 870.9393 894.7655 910.5182 938.8587 970.7015 973.4994 975.1306 980.9872 1002.9546 1019.8847 1023.8577 1030.6082 1040.5667 1050.4432 1054.5238 1064.1053 1068.7199 1081.9676 1110.4524 1111.8925 1125.1042 1135.4495 1139.4714 1153.2306 1162.3613 1172.1231 1179.7380 1203.5354 1215.8509 1235.7663 1243.3382 1249.3205 1261.5716 1270.5356 1275.2070 1287.3374 1315.5622 1320.1293 1333.3495 1341.4138 1351.7964 1358.9262 1370.0419 1370.8844 1379.1798 1380.4538 1382.3794 1400.4523 1408.5291 1428.0576 1441.2208 1456.8325 1457.1521 1463.2860 1468.7065 1471.6294 1476.3438 1478.1699 1480.2788 1482.1181 1488.2383 1488.9780 1497.4942 1516.1915 1572.8636 1585.6782 1587.8637 1598.8167 1616.4003 1661.4582 2860.0782 2940.0972 2977.6613 2982.0527 2989.3213 2995.1379 2996.7134 3006.3529 3010.0957 3034.9770 3040.5253 3068.8319 3072.4801 3075.3241 3080.9669 3087.2487 3093.8427 3095.5973 3108.0208 3133.6691 3136.2174 3149.5234 3151.6926 3166.6065 3193.8840 3195.8981 3544.6599
redmass: 4.5494 3.4447 3.9218 3.0243 3.7218 2.7318 5.8034 5.4403 3.8477 3.4863 3.9261 4.3500 3.7328 2.4409 4.1349 3.0117 2.1403 4.6558 3.3511 3.9118 2.6600 1.4485 1.2221 4.6898 1.9384 3.9497 2.0092 6.0479 6.9600 5.0345 4.3554 5.9068 8.6077 2.7543 3.2354 5.2886 3.2726 6.3739 3.8140 2.7812 3.0725 4.1222 5.2762 3.9962 2.7945 3.6610 1.9703 6.9126 5.9491 6.2324 5.4992 4.8348 3.9651 4.3742 4.2124 1.3596 2.3615 1.1851 1.3226 1.0943 1.3500 4.9821 1.3271 1.3716 2.0861 2.7658 2.1050 4.5596 1.4085 3.8601 2.8936 1.3538 1.3267 3.5795 3.4848 3.6819 2.1992 3.3706 2.2820 2.6092 4.2579 2.3021 2.1020 1.7150 2.2154 1.6958 1.6841 1.4602 1.4491 2.9715 1.1262 1.9140 2.0812 1.7877 1.9994 1.6384 1.1324 1.8896 1.2242 1.4365 1.3472 1.9586 2.1082 1.3374 1.2445 1.6413 1.3061 1.4381 3.1425 7.7963 1.2218 1.2573 1.3081 3.7223 2.2409 1.1046 1.0834 2.4597 1.0403 1.0507 1.0534 1.0583 1.0672 2.8428 1.0622 1.0787 1.0896 1.0779 2.3579 6.6188 6.1543 7.8977 7.0935 6.5848 8.2463 1.0720 1.0657 1.0352 1.0369 1.0602 1.0664 1.0358 1.0859 1.0581 1.0979 1.0977 1.1069 1.0990 1.0989 1.1010 1.1004 1.0985 1.0961 1.1027 1.0920 1.0858 1.0916 1.0908 1.0985 1.0949 1.0956 1.0762
irintensity: 0.2057 0.0341 0.4712 0.2952 0.4258 0.1720 2.7748 2.8448 0.3372 0.8651 0.5795 1.1682 4.3729 1.3307 1.4896 4.1426 1.8246 0.0605 2.2861 2.4072 1.8044 0.8024 0.3896 11.2044 1.9816 8.6704 1.5366 2.1062 10.8397 0.7588 1.0907 5.8048 0.6649 3.0028 2.8585 2.8182 0.6904 6.0905 12.5413 14.8342 6.6875 7.0368 2.6937 22.3390 14.2226 18.7340 20.9726 6.2697 2.4172 2.7643 46.0297 2.1942 1.3745 6.6917 17.0556 78.4754 10.0711 2.0644 4.4451 4.1496 7.1380 2.3194 25.9941 1.8534 33.6113 22.7148 2.1288 14.4585 1.0847 31.2404 53.6986 5.9733 0.3131 3.6401 0.6681 12.2568 10.3133 185.5052 30.1202 45.0682 135.7807 105.1016 18.4152 35.9268 14.4762 21.1094 56.1301 5.0083 7.2425 445.2724 21.1943 121.8530 50.7539 73.1090 44.8615 9.5475 0.0098 63.7493 45.3236 4.0495 47.6930 68.0861 98.5903 55.5780 23.7005 118.0994 13.0747 17.6169 69.5122 33.5894 25.9220 22.8629 35.5749 43.2460 20.6924 18.8234 29.4332 137.9678 12.2172 11.1170 7.7523 21.6613 2.9053 97.5430 7.9586 17.4500 25.4196 1.0988 520.2835 193.7760 19.4298 90.6720 36.1513 99.1514 255.6910 98.6029 29.2243 31.0459 26.3271 44.0138 11.6435 22.1127 25.5562 26.3692 9.0232 22.9773 7.9514 38.9799 62.9498 47.7082 48.1910 31.5937 14.6518 44.4855 7.8146 1.2671 10.7597 4.4256 30.3571 6.6446 2.0691 26.9480
temp: 298.150 k
press: 1.00000 atm
elementType: 16 8 8 8 7 7 7 6 6 6 6 6 6 6 6 6 6 6 6 6 6 6 6 6 6 6 6 6 6 1 1 1 1 1 1 1 1 1 1 1 1 1 1 1 1 1 1 1 1 1 1 1 1 1 1 1
symmnumber: 1
zpe: 1187158.4 jmol-1
zpe.correction: 0.452165 hartree
zpe.thermalcorrener: 0.481851 hartree
zpe.thermalcorrenthalpy: 0.482795 hartree
zpe.thermalcorrgfe: 0.386760 hartree
zpe.sumelectzpe: -1640.394529 hartree
zpe.sumelectthermal: -1640.364842 hartree
zpe.sumelectthermalent: -1640.363898 hartree
zpe.sumelectthermalfe: -1640.459934 hartree
dipole: -2.9315 0.8601 -1.4799
dipole: 3.3946
quadrupole: -164.6739 -170.6986 -176.8708
quadrupole: -11.4554 11.8899 3.7444
quadrupole: 6.0739 0.0492 -6.1231 -11.4554 11.8899 3.7444
hfenergy: -1640.8466935 hartree
pointgroup: C01 [X(C22H27N3O3S1)]
dipole: -1.1008283 0.5491621 -0.5198454 debye
polarizability: 370.5176671|-57.7518516|298.4412118|-28.532584|-16.6654651|248.4486232 unknown
InChI: InChI=1S/C22H27N3O3S/c1-4-24(5-2)14-13-21(26)25-17-9-7-8-10-19(17)29-20-12-11-16(15-18(20)25)23-22(27)28-6-3/h7-12,15,23H,4-6,13-14H2,1-3H3
charge 0 multiplicity 1
56 atoms
S  1.924983 -2.682254 1.779669
O  3.074773 0.699714 -1.617269
O  -5.37579 0.479791 -0.554635
O  -4.937956 -0.959442 1.259917
N  1.695593 3.968348 0.772366
N  1.608441 -0.796032 -0.573617
N  -3.246098 -0.180062 -0.213861
C  2.378339 2.730332 0.328544
C  1.349071 1.700666 -0.222725
C  2.065054 0.518712 -0.876354
C  0.360424 -1.06798 0.099387
C  2.431372 -1.947555 -0.896354
C  2.238282 4.553346 2.023587
C  1.470928 4.92703 -0.337549
C  0.346254 -1.940846 1.215584
C  2.65611 -2.923183 0.107632
C  -0.853736 -0.530858 -0.378706
C  3.004477 -2.123242 -2.177538
C  3.667165 5.15915 1.939554
C  0.436105 6.018298 -0.005385
C  -0.86951 -2.218152 1.873442
C  -2.071003 -0.786886 0.301967
C  3.452706 -4.057428 -0.15495
C  -2.077273 -1.63423 1.442531
C  3.819744 -3.246543 -2.434419
C  4.047936 -4.211837 -1.426772
C  -4.54164 -0.295588 0.27011
C  -6.819732 0.477249 -0.179592
C  -7.535304 1.370038 -1.187785
H  2.897229 2.2789 1.19455
H  3.150433 2.913443 -0.45035
H  0.670958 1.3971 0.588973
H  0.732552 2.207119 -0.991358
H  2.227814 3.755007 2.790419
H  1.533403 5.328232 2.378187
H  1.100564 4.344771 -1.203527
H  2.423227 5.406286 -0.678097
H  -0.840579 0.094658 -1.27867
H  2.83457 -1.368279 -2.946921
H  3.710661 6.00887 1.233999
H  3.982463 5.530444 2.932668
H  4.403821 4.403498 1.61025
H  0.219593 6.623858 -0.904782
H  0.794925 6.708895 0.779037
H  -0.504757 5.558342 0.345668
H  -0.876149 -2.899325 2.730366
H  3.601328 -4.809955 0.626209
H  -3.01624 -1.838823 1.959725
H  4.274121 -3.367205 -3.423371
H  4.675751 -5.085886 -1.629703
H  -3.149085 0.417476 -1.037526
H  -6.911979 0.851231 0.85612
H  -7.184713 -0.565436 -0.204231
H  -7.141248 2.40009 -1.152959
H  -7.414219 0.983365 -2.214082
H  -8.614964 1.403168 -0.954175
