program: Gaussian 09
title: 000107792
version: EM64L-G09RevD.01
frameworkgroup: C1[X(C3H7NO2)]
method: RPBEPBE
basis: SDD
operation: Freq
keyword: #pfreq=noraman
keyword: PBEPBE/SDD
title: #p freq=noraman PBEPBE/SDD
converged: YES YES NO NO
title: Mulliken charges:
elementType: O O N C C C H H H H H H H
charge: -0.411311 -0.324901 0.045592 0.359079 -0.788069 -0.733396 0.235577 0.236148 0.282383 0.253800 0.253942 0.223542 0.367612
chargesum: 0.00000
title: Mulliken charges with hydrogens summed into heavy atoms:
elementType: O O N C C C
charge: -0.043698 -0.324901 0.045592 0.359079 -0.033961 -0.002112
polarizability: 6.95832695e+01 -3.88013083e+00 5.66299356e+01 -2.72788208e-02 3.28485372e-02 3.01441964e+01
1716.lowfreq: -8.0089 -0.0013 -0.0010 -0.0009 6.8447 8.3387 26.0477 113.6062 162.7629
frequency: 24.7538 113.4770 162.7618 262.3930 296.1898 323.3807 348.8578 462.7430 497.6191 565.2240 676.4151 869.4433 978.9541 984.0683 1029.1827 1071.5851 1175.1272 1292.7197 1323.9013 1397.2743 1405.0727 1452.1337 1463.2455 1471.2131 1471.7511 1666.1764 2971.6735 2978.5535 3038.0267 3050.7170 3110.9331 3136.4560 3472.9947
redmass: 1.0433 1.0808 3.9204 3.7575 2.4347 1.1699 2.6287 4.5330 6.7938 8.2311 5.4535 3.4900 1.2376 1.3588 1.9051 1.5060 2.2767 2.5115 2.9204 1.2399 1.2325 1.0442 1.0808 1.0518 1.0568 5.4451 1.0396 1.0381 1.0972 1.0973 1.0988 1.0955 1.0660
irintensity: 0.8519 1.4779 0.8530 2.6698 28.2881 132.1391 7.3323 10.9048 32.4245 4.3674 22.5139 103.8306 0.1111 12.5958 67.2644 6.0093 113.0800 46.8999 14.0049 30.8008 3.4288 15.6068 9.2889 15.9973 13.7344 65.6325 20.7229 21.6189 19.9009 14.1074 13.4857 3.3066 39.5519
temp: 298.150 k
press: 1.00000 atm
elementType: 8 8 7 6 6 6 1 1 1 1 1 1 1
symmnumber: 1
zpe: 266438.4 jmol-1
zpe.correction: 0.101481 hartree
zpe.thermalcorrener: 0.109244 hartree
zpe.thermalcorrenthalpy: 0.110188 hartree
zpe.thermalcorrgfe: 0.069069 hartree
zpe.sumelectzpe: -323.131749 hartree
zpe.sumelectthermal: -323.123986 hartree
zpe.sumelectthermalent: -323.123042 hartree
zpe.sumelectthermalfe: -323.164161 hartree
dipole: -1.9118 1.1987 -0.0045
dipole: 2.2565
quadrupole: -30.8368 -39.5110 -36.6003
quadrupole: 2.5945 -0.0218 -0.0074
quadrupole: 4.8126 -3.8617 -0.9509 2.5945 -0.0218 -0.0074
hfenergy: -323.2332297 hartree
pointgroup: C01 [X(C3H7N1O2)]
dipole: 0.7592996 -0.4589781 -0.0310989 debye
dipolederiv: -0.6449876 -0.5330171 0.0422277 -0.5037412 -0.7197861 0.0474605 0.041279 0.0496841 -0.40647 -0.8009758 0.2721492 0.0220586 0.4062727 -0.8893247 0.0019505 0.0158792 0.0103209 -0.2795944 1.1627745 0.0374499 -0.0751003 -0.045022 1.1905641 -0.0495812 -0.0709762 -0.0544793 0.0824799 -0.071016 0.0737372 -0.0042012 0.0431551 0.2297635 -0.017059 0.0022088 -0.0214815 -0.0842576 -0.0833085 0.0121573 0.0123423 -0.0473635 -0.1270129 0.0131348 0.0095203 0.0111557 0.1075055 0.1066208 -0.0381911 0.0000773 -0.0785574 -0.1214072 0.0141534 -0.000193 0.0121128 0.0767721 0.0290381 0.0512655 0.1050925 0.0742879 0.0664973 0.0057859 0.1311707 -0.0464044 -0.0505794 0.0026422 0.0476076 -0.1141599 0.0641608 0.0672198 -0.0220855 -0.1421372 0.0331162 -0.0265798 0.0502708 -0.1173571 0.0084541 -0.0509328 0.0192555 0.007059 0.0071277 0.0108403 0.1365635 0.0519524 0.0206114 0.0460429 -0.0518361 0.0187525 -0.0841577 -0.0132907 -0.0997652 -0.024875 0.0467681 0.0294528 -0.0597086 -0.0387172 0.0345658 0.0853689 0.0063206 0.0912175 -0.0338216 -0.1108654 0.041123 0.01371 0.0826921 0.0752319 -0.0042732 0.0122409 -0.001201 0.1119092 0.2610864 0.1030115 0.0031645 0.1456016 0.1556804 0.0022437 0.0008499 0.004884 0.3909477 unknown
polarizability: 69.5566247|-3.7386211|56.448241|-2.4275814|-1.0056815|30.3525357 unknown
InChI: InChI=1S/C3H7NO2/c1-3(2)4(5)6/h5H,1-2H3
charge 0 multiplicity 1
13 atoms
O  -1.522559 -1.073114 0.174279
O  -1.309433 1.296318 0.048617
N  -0.660041 0.167541 0.057824
C  0.649168 -0.057174 -0.019785
C  1.22737 -1.444689 0.006617
C  1.517941 1.17242 -0.133473
H  1.82484 -1.627838 -0.907486
H  1.914886 -1.558489 0.867414
H  0.445456 -2.213314 0.07728
H  1.379894 1.842648 0.736247
H  1.256856 1.766693 -1.029741
H  2.577924 0.879011 -0.194509
H  -2.426101 -0.645411 0.210916
