program: Gaussian 09
title: 000107794
version: EM64L-G09RevD.01
frameworkgroup: C1[X(C9H11NO5)]
method: RPBEPBE
basis: SDD
operation: Freq
keyword: #p
keyword: freq=noraman
keyword: PBEPBE/SDD
title: #p freq=noraman PBEPBE/SDD
converged: YES YES NO NO
title: Mulliken charges:
elementType: O O O O O N C C C C C C C C C H H H H H H H H H H H
charge: -0.438923 -0.410996 -0.413981 -0.400413 -0.258248 -0.553878 -0.546420 -0.217689 0.438499 0.118035 -0.530103 0.151185 -0.521691 0.186113 0.174622 0.217050 0.256592 0.291022 0.252447 0.209650 0.277982 0.285499 0.354715 0.355577 0.371640 0.351715
chargesum: 0.00000
title: Mulliken charges with hydrogens summed into heavy atoms:
elementType: O O O O O N C C C C C C C C C
charge: -0.084209 -0.055419 -0.042341 -0.048698 -0.258248 0.009603 -0.072777 0.073332 0.438499 0.118035 -0.277656 0.151185 -0.312041 0.186113 0.174622
polarizability: 1.49475333e+02 1.26418415e+01 1.30005381e+02 -1.68570318e+01 1.18026302e+01 8.92297500e+01
1716.lowfreq: -8.7292 -0.0005 -0.0005 0.0006 6.9314 7.8647 27.8992 33.3344 55.7187
frequency: 27.8683 33.2878 55.7114 72.8408 114.5230 168.5146 217.7330 236.6956 256.3375 280.2144 286.4365 292.8499 299.5222 311.8891 321.0062 325.0585 340.3939 390.1864 432.1629 451.2471 471.9458 526.4342 573.4173 582.6156 593.4389 627.2728 660.3462 690.8724 701.6463 720.2322 744.1725 779.7763 786.9426 833.0539 857.3771 955.7998 992.6197 1044.3274 1062.1533 1092.6583 1099.6667 1127.7843 1146.1257 1173.2538 1199.6658 1211.3365 1242.3477 1271.9272 1312.2661 1315.5708 1327.6605 1342.4439 1370.9225 1410.0941 1414.2693 1456.5201 1536.3805 1619.9421 1633.8586 1640.3118 1644.8611 3008.1024 3073.8563 3088.0465 3100.7920 3120.5827 3456.4239 3493.7379 3577.2233 3580.4891 3589.9309 3591.4746
redmass: 5.7876 7.4494 9.3680 4.6536 6.6116 6.1870 5.5436 3.1315 3.2872 2.7471 2.4906 1.4704 2.3254 1.1405 1.8702 1.2395 3.1790 8.3092 3.3028 5.2395 3.6295 4.9607 2.6668 1.5801 3.1807 1.4874 6.8471 4.2697 2.9390 5.1526 5.1121 2.6054 2.4753 3.0186 1.5271 1.8865 2.8484 2.2536 4.3750 2.0974 3.4150 1.3707 1.3066 1.2370 1.4389 1.4351 1.5573 1.9819 1.4630 2.7918 1.7806 1.7769 1.3398 6.0211 4.3177 1.1398 3.3147 7.0735 1.1362 6.1875 6.6961 1.0616 1.0906 1.0964 1.0909 1.0916 1.0445 1.0638 1.0659 1.0663 1.0987 1.0662
irintensity: 0.5947 1.3788 1.4578 0.5326 0.3013 2.1402 1.9750 5.9014 4.2014 42.1967 24.7886 50.0797 16.7839 23.2455 96.3517 164.5826 45.5313 0.7004 11.8806 3.4633 68.9095 9.0848 72.7219 178.7006 45.7162 119.0536 7.3956 16.4117 23.0262 17.6341 9.6468 7.7948 35.2708 8.4367 24.5168 17.2426 62.4940 210.1226 90.1382 252.0179 21.8306 274.0225 202.6830 4.9359 22.6201 10.8788 5.0094 6.3312 21.9245 5.9636 20.4613 14.2537 8.0854 45.0562 43.1047 19.4427 128.4551 11.1447 57.8099 20.6639 157.5950 21.7186 1.9825 8.0837 17.6775 4.7115 3.0898 14.4087 35.5788 40.0961 5.0484 25.1894
temp: 298.150 k
press: 1.00000 atm
elementType: 8 8 8 8 8 7 6 6 6 6 6 6 6 6 6 1 1 1 1 1 1 1 1 1 1 1
symmnumber: 1
zpe: 510742.3 jmol-1
zpe.correction: 0.194531 hartree
zpe.thermalcorrener: 0.210080 hartree
zpe.thermalcorrenthalpy: 0.211024 hartree
zpe.thermalcorrgfe: 0.151197 hartree
zpe.sumelectzpe: -779.282145 hartree
zpe.sumelectthermal: -779.266597 hartree
zpe.sumelectthermalent: -779.265653 hartree
zpe.sumelectthermalfe: -779.325480 hartree
dipole: 1.0138 1.9703 1.6441
dipole: 2.7591
quadrupole: -84.6167 -78.4744 -83.5172
quadrupole: -15.1019 -1.5193 5.9367
quadrupole: -2.4139 3.7284 -1.3144 -15.1019 -1.5193 5.9367
hfenergy: -779.4766768 hartree
pointgroup: C01 [X(C9H11N1O5)]
dipole: -0.4525648 0.8521856 -0.4973339 debye
dipolederiv: -0.4129055 0.5179633 -0.0740929 0.4815604 -1.0712008 -0.0774805 -0.1065655 -0.0523288 -0.3467154 -0.4354619 0.5457061 -0.1106453 0.6455909 -1.0698807 -0.072411 -0.1122898 -0.0648134 -0.3370475 -0.4162454 -0.0037139 -0.1599185 -0.0297826 -0.2224221 0.0810353 -0.2222675 0.1123158 -1.2052196 -1.3714737 -0.0802593 0.3370556 -0.1058573 -0.0398781 -0.0341563 0.4040643 -0.0405301 -0.519614 -0.403234 -0.0245435 -0.0819822 0.1750993 -0.900635 0.1769197 -0.1758638 -0.006903 -0.6265796 -0.6785751 0.044268 0.1270777 0.1371546 -0.555469 -0.3408635 0.122187 -0.3429684 -0.4488658 0.0021487 0.0370737 -0.0077483 0.0452434 0.0833634 -0.07097 -0.1119531 -0.0477152 0.1045534 0.527365 0.0765815 -0.0231555 0.0047865 0.198374 0.0738202 0.0671583 0.0806442 0.125862 0.0968739 -0.0920043 -0.0323865 0.2874637 -0.2005638 -0.0750019 -0.1840063 0.0464685 -0.0932752 0.2400657 -0.3299509 -0.0211073 -0.5046536 0.9822757 0.0300173 0.0454619 -0.069024 0.0421235 0.033246 0.1588854 -0.1129099 -0.1112735 -0.0259816 0.0217657 -0.044222 -0.0619116 -0.1310398 0.0349687 -0.476923 0.0790468 -0.8788822 0.9716247 0.0881169 0.1595507 0.0004197 -0.0322071 -0.2939164 0.1263641 -0.0127669 0.0905112 -0.1272797 -0.0613002 -0.0032773 -0.0715451 -0.2126227 0.1926355 -0.108894 0.2048484 -0.1365714 0.9662367 -0.1499675 0.3847251 -0.0004223 1.4270467 1.2481412 -0.0147963 -0.4136671 0.3924059 0.00764 -0.1182786 -0.5351622 0.0108574 0.2497315 0.0082617 -0.0097804 0.024613 -0.0489441 -0.0354865 0.1406323 0.0340982 0.0636321 0.0146157 0.0289305 0.0087096 0.0225587 0.0250651 0.0093376 -0.0857103 0.0153284 -0.0677739 0.0211564 0.0822116 -0.0001028 0.0189519 0.0086269 -0.0020006 0.0574202 0.050603 0.0597061 -0.0007732 0.1098535 -0.0395146 0.0533742 -0.0354662 -0.0477124 0.046469 0.0508937 0.0414946 0.1318866 0.0210908 -0.0551182 0.0687929 -0.0638246 -0.0722394 0.0726686 0.0763963 0.0778707 0.1405078 0.1727757 0.0130336 -0.0083041 -0.0378755 0.1044114 0.1638798 0.004924 0.1063542 0.2692735 0.0606356 -0.0296312 -0.0542031 -0.1196243 0.3156145 0.055815 -0.1010453 0.0760142 0.1104636 0.1609359 -0.1736167 0.085695 -0.0996759 0.2936553 0.0520277 0.0944942 0.0681127 0.3259345 0.1904064 -0.1631593 0.1067338 -0.1274145 0.3126464 0.049154 0.100581 0.0632787 0.3243104 0.3946103 0.0289447 -0.003215 0.0076435 0.0759687 -0.0921548 -0.0037889 -0.0303194 0.2984927 0.4066554 0.0444784 -0.0126456 -0.0013059 0.0496012 0.0685529 -0.0100242 0.0490861 0.3680015 unknown
polarizability: 149.4049654|-8.9367526|131.8702712|-20.0547287|-5.1054656|87.4352271 unknown
InChI: InChI=1S/C9H11NO5/c10-5(9(14)15)1-4-2-7(12)8(13)3-6(4)11/h2-3,5,11-14H,1,10H2
charge 0 multiplicity 1
26 atoms
O  -0.151568 2.663859 0.302227
O  2.9045 -2.077321 0.080296
O  -2.579946 -0.751893 -2.017674
O  4.012955 0.231928 -0.815317
O  -2.165792 -2.157108 -0.2142
N  -3.802442 0.38598 0.774168
C  -1.37207 0.308333 1.287959
C  -2.454127 0.290483 0.178539
C  0.042468 0.301603 0.738112
C  0.636949 1.490501 0.250674
C  0.810651 -0.885857 0.674003
C  2.122993 -0.911129 0.157159
C  1.953048 1.4930 -0.26723
C  -2.346825 -0.996942 -0.6556
C  2.70384 0.296363 -0.315035
H  -1.524811 -0.570031 1.942942
H  -1.55609 1.222061 1.878051
H  -2.306287 1.156183 -0.486234
H  0.352656 -1.818677 1.028322
H  2.400589 2.425878 -0.639339
H  -4.042228 -0.396806 1.391918
H  -4.54936 0.614184 0.111633
H  0.364922 3.450057 -0.001244
H  2.386273 -2.851646 0.413597
H  -2.560721 -1.614416 -2.516794
H  4.313723 1.126514 -1.112632
