program: Gaussian 09
title: 000107817
version: EM64L-G09RevD.01
frameworkgroup: C1[X(C11H19N3O6)]
method: RPBEPBE
basis: SDD
operation: Freq
keyword: #p
keyword: freq=noraman
keyword: PBEPBE/SDD
title: #p freq=noraman PBEPBE/SDD
converged: YES YES NO NO
title: Mulliken charges:
elementType: O O O O O O N N N C C C C C C C C C C C H H H H H H H H H H H H H H H H H H H
charge: -0.462093 -0.219975 -0.260727 -0.463064 -0.378653 -0.253957 -0.369984 -0.371164 -0.573555 0.178752 -0.430641 -0.410465 -0.395100 0.099158 -0.264821 0.208076 -0.162541 -0.092907 -0.684618 0.188619 0.255137 0.210516 0.253707 0.238003 0.219895 0.230238 0.311282 0.222043 0.348901 0.287055 0.323225 0.289030 0.276815 0.216357 0.224519 0.213257 0.242505 0.370844 0.386332
chargesum: 0.00000
title: Mulliken charges with hydrogens summed into heavy atoms:
elementType: O O O O O O N N N C C C C C C C C C C C
charge: -0.113191 -0.219975 -0.260727 -0.092221 0.007679 -0.253957 -0.058702 -0.047940 -0.007710 0.178752 0.035012 0.081245 0.055033 0.099158 -0.042779 0.208076 0.124514 0.123450 -0.004337 0.188619
polarizability: 1.82236118e+02 -1.01909681e+01 1.46002889e+02 5.93670184e+00 -3.45261895e+00 1.52415295e+02
1716.lowfreq: -3.8726 0.0003 0.0007 0.0011 0.9903 9.4417 13.7475 17.2072 24.1634
frequency: 13.4945 16.8940 24.1283 30.1995 45.1717 59.3304 76.0685 88.3767 107.5597 127.5845 146.3623 155.3776 157.1480 198.6159 207.6733 213.6675 226.1693 241.4005 259.4538 288.0602 296.8566 319.4242 332.5965 337.0090 352.3218 368.1125 392.1538 441.7760 487.2720 541.4256 579.6163 586.4262 600.0466 621.9855 650.6499 663.7284 686.6303 693.6528 699.9338 719.1420 732.1642 754.2482 774.4711 781.0588 829.7510 868.0771 894.4966 910.1749 932.9093 939.6203 954.7554 967.8008 990.8341 1012.0841 1040.1089 1050.4300 1071.4972 1080.0306 1098.5628 1116.0914 1125.1094 1132.7998 1141.9481 1151.2301 1183.1633 1193.3679 1231.7813 1233.5901 1248.1806 1253.2267 1265.1711 1277.2376 1286.6397 1301.0578 1316.2529 1324.0075 1350.7982 1357.6442 1360.1311 1370.7774 1381.3061 1399.3961 1454.7524 1454.9079 1461.1562 1469.8834 1476.7402 1477.1269 1609.0476 1622.8208 1651.7623 1735.2560 2971.2462 2971.4364 2983.7829 2994.9496 2999.4038 3024.7570 3037.5417 3057.2062 3060.3261 3098.0970 3102.0855 3108.3022 3418.9854 3454.5822 3492.1970 3504.5495 3543.7118 3547.2765 3548.9258
redmass: 6.8445 6.0779 6.7605 6.5307 4.4931 5.0408 7.0836 4.4812 3.7664 4.4168 3.8753 3.3693 4.6448 1.1360 2.0163 1.8983 2.3042 2.9038 2.9546 2.4279 3.8756 3.7760 4.2050 5.9670 2.2137 3.5440 2.6433 3.2101 2.7263 1.3488 1.5716 1.9706 2.9223 1.4739 3.0253 1.8180 2.8813 4.7950 3.0184 4.8760 2.4277 3.2083 3.6310 1.3615 3.1170 3.4532 2.6816 3.0097 1.9105 2.7392 2.9735 2.5438 2.0165 2.0410 2.2072 2.4495 2.0917 2.0851 2.0981 1.2166 2.1674 2.0494 3.0923 1.6238 1.7962 2.2965 1.5013 1.4035 1.5393 1.5184 1.2162 1.4581 1.4748 1.3959 1.6753 1.3560 1.5570 1.9693 1.7108 1.4068 1.3336 1.5149 1.1468 1.4777 1.1613 1.0966 1.0479 1.0908 7.7625 7.3190 1.0911 10.3146 1.0640 1.0850 1.0690 1.0760 1.0362 1.0577 1.0954 1.0845 1.1019 1.0996 1.1101 1.1000 1.0458 1.0649 1.0639 1.0771 1.0949 1.0700 1.0776
irintensity: 0.5937 1.0705 2.6710 0.1901 3.9432 0.2148 1.7003 8.4346 2.7057 4.0724 5.1433 1.0314 1.2927 0.7564 26.7101 58.9431 8.8100 19.0069 38.5446 40.3097 36.4770 7.9043 20.5196 9.3271 37.9962 11.9567 38.7992 9.9141 14.2362 117.2905 119.8550 63.0190 42.8135 80.4759 45.1192 149.3539 34.2487 29.2232 61.2327 7.0573 178.8142 52.2569 82.9530 20.9668 23.8387 11.1765 45.2959 0.5451 2.8563 23.6832 3.1291 8.5044 12.1444 2.6442 14.5157 43.8248 169.5600 19.4893 33.3592 1.4840 26.6834 33.2863 99.0295 38.0234 16.2590 19.4712 1.9798 22.1465 36.1694 0.8967 72.1660 90.1684 9.6773 0.6440 12.1948 6.6607 1.7626 8.5592 66.0433 5.1307 25.8930 51.8650 30.4781 82.9802 71.1880 16.1371 7.1154 7.8222 274.3491 136.1116 35.7493 404.0128 15.5788 43.7457 4.6772 36.7895 13.2679 37.4934 2.1691 15.7436 40.2532 27.9848 20.9910 22.5900 1.9503 52.5555 23.6936 43.7562 6.3961 7.6556 19.8490
temp: 298.150 k
press: 1.00000 atm
elementType: 8 8 8 8 8 8 7 7 7 6 6 6 6 6 6 6 6 6 6 6 1 1 1 1 1 1 1 1 1 1 1 1 1 1 1 1 1 1 1
symmnumber: 1
zpe: 813881.1 jmol-1
zpe.correction: 0.309991 hartree
zpe.thermalcorrener: 0.332524 hartree
zpe.thermalcorrenthalpy: 0.333468 hartree
zpe.thermalcorrgfe: 0.254410 hartree
zpe.sumelectzpe: -1044.593216 hartree
zpe.sumelectthermal: -1044.570683 hartree
zpe.sumelectthermalent: -1044.569739 hartree
zpe.sumelectthermalfe: -1044.648798 hartree
dipole: 2.3097 -0.1288 -2.3921
dipole: 3.3277
quadrupole: -121.9242 -114.1550 -127.4330
quadrupole: -1.4956 15.0359 5.5264
quadrupole: -0.7535 7.0158 -6.2623 -1.4956 15.0359 5.5264
hfenergy: -1044.9032074 hartree
pointgroup: C01 [X(C11H19N3O6)]
dipole: -0.9599215 -0.1168318 -0.8825993 debye
polarizability: 181.6385834|-10.9097302|147.4799494|-5.7211121|4.9901722|151.5357687 unknown
InChI: InChI=1S/C11H19N3O6/c1-5(15)7(9(17)18)14-8(16)6(12)2-3-11(20)4-13-10(11)19/h5-7,13-15,17,20H,2-4,12H2,1H3
charge 0 multiplicity 1
39 atoms
O  3.095018 1.94359 -0.086206
O  5.576527 0.474888 1.517578
O  -1.590811 -1.687374 -1.440583
O  -3.975338 0.682682 2.201625
O  -3.054091 1.661948 -1.945244
O  -3.654767 2.552933 0.106772
N  5.439453 0.013076 -0.867572
N  -2.086125 -0.274748 0.344806
N  0.638206 -2.752431 -0.006639
C  3.528937 0.543012 -0.115374
C  2.48654 -0.410744 0.47603
C  4.111493 0.196167 -1.532075
C  1.120636 -0.323865 -0.234225
C  5.006707 0.352857 0.412275
C  0.133089 -1.402337 0.298692
C  -1.25877 -1.148599 -0.341328
C  -3.428083 0.090856 -0.129626
C  -4.46244 -0.063378 1.024156
C  -4.649978 -1.517351 1.456803
C  -3.404784 1.548954 -0.61147
H  2.850325 -1.453519 0.410572
H  2.372768 -0.180365 1.555955
H  4.070856 1.047694 -2.230015
H  3.712074 -0.721163 -1.995624
H  1.245257 -0.483751 -1.324035
H  0.691043 0.687423 -0.107836
H  6.359076 -0.231042 -1.24023
H  0.061905 -1.297319 1.400232
H  3.144105 2.263773 0.851566
H  -3.659764 -0.566259 -0.986198
H  -1.851217 0.053616 1.287318
H  0.470989 -2.982934 -0.996425
H  0.24448 -3.480728 0.600428
H  -5.430066 0.361533 0.682061
H  -3.690853 -1.954326 1.784041
H  -5.050377 -2.127042 0.627571
H  -5.35482 -1.561038 2.303464
H  -3.970907 1.647974 1.947917
H  -2.999392 2.622538 -2.207256
