program: Gaussian 09
title: 000107814
version: EM64L-G09RevD.01
frameworkgroup: C1[X(C17H19N2S)]
method: RPBEPBE
basis: SDD
operation: Freq
keyword: #p
keyword: freq=noraman
keyword: PBEPBE/SDD
title: #p freq=noraman PBEPBE/SDD
converged: YES YES NO NO
title: Mulliken charges:
elementType: S N N C C C C C C C C C C C C C C C C C H H H H H H H H H H H H H H H H H H H
charge: 0.257660 -0.139509 -0.139520 0.670337 0.670351 -0.353605 -0.353517 -0.441284 0.430532 0.430545 -0.408101 -0.408162 -0.404058 -0.404051 -0.356776 -0.356824 -0.641830 -0.635298 -0.635180 -0.641815 0.263937 0.272130 0.272098 0.251755 0.251747 0.266089 0.266061 0.244034 0.255096 0.255166 0.256075 0.241642 0.256154 0.241600 0.256059 0.256185 0.244006 0.255208 0.255062
chargesum: 1.00000
title: Mulliken charges with hydrogens summed into heavy atoms:
elementType: S N N C C C C C C C C C C C C C C C C C
charge: 0.257660 -0.139509 -0.139520 0.670337 0.670351 -0.353605 -0.353517 -0.177347 0.430532 0.430545 -0.135971 -0.136064 -0.152304 -0.152304 -0.090687 -0.090763 0.112466 0.118574 0.118664 0.112461
polarizability: 6.16253935e+02 1.99470996e-03 2.08955552e+02 -1.64295105e-02 -7.13664175e-02 9.83681716e+01
1716.lowfreq: -9.4380 -0.0014 -0.0008 0.0005 1.9506 5.6658 30.9349 46.8315 60.5090
frequency: 30.9267 46.8306 60.4921 68.1511 102.5837 126.3976 133.7806 137.0804 141.9454 150.5745 179.7133 188.6714 208.5612 230.6125 252.7451 269.9687 289.3568 339.2140 345.1537 378.7151 422.6896 428.6044 433.1410 449.3525 454.6206 470.4624 495.8658 507.5533 533.8663 582.2405 602.3911 611.4058 664.8163 666.5869 739.9781 747.6979 761.6245 762.6566 808.8626 822.5532 852.7984 857.8695 860.7087 880.0421 938.3905 948.3363 948.6453 974.5092 987.7064 1024.1393 1048.3725 1052.1844 1052.6650 1092.1320 1092.2534 1116.7625 1116.7696 1148.3753 1165.3168 1171.4936 1183.1736 1218.0858 1236.3593 1236.8596 1284.7795 1298.5080 1300.0629 1359.9334 1371.9513 1390.5455 1400.1610 1433.5346 1434.5171 1446.6009 1456.3799 1461.0521 1469.5899 1469.6390 1474.0418 1475.1023 1486.2291 1486.5531 1486.5663 1489.2066 1498.9418 1502.1464 1512.6587 1523.3918 1544.2111 1581.8097 1616.7601 1645.9767 2976.2121 2976.3220 2983.1273 2983.6677 3054.5467 3054.5638 3062.3288 3062.3450 3120.0842 3126.8856 3126.9048 3136.5011 3136.5576 3141.6898 3142.0044 3171.3298 3171.6134 3187.3028 3187.3811
redmass: 5.3495 2.7277 2.3509 2.8679 4.2123 1.7225 2.6463 1.2638 1.1296 1.6478 3.9486 1.8255 2.4668 5.2700 3.6439 3.8190 3.0574 4.1979 3.8709 4.1430 3.0452 9.1681 5.5152 3.3966 2.9737 3.9392 4.5359 3.8855 3.5630 4.2875 3.9281 3.2359 7.0182 7.0180 3.2395 3.2306 5.6612 5.9991 1.3965 1.5210 6.1442 1.6157 1.6415 5.9023 1.3962 2.9612 2.9395 1.3533 1.4659 3.3156 3.0829 1.6041 1.6964 1.2334 1.2335 1.3534 1.3533 1.8662 1.7043 1.6331 1.4458 1.2463 2.7972 2.6097 1.5966 1.3798 2.3057 2.0295 3.0210 2.5878 3.4845 1.2066 1.1471 1.6129 1.2023 1.8457 1.0391 1.0390 1.6559 1.7413 1.6168 1.0574 1.0500 1.8528 1.7460 1.2917 6.1145 2.0169 3.0331 5.9386 5.6574 6.7228 1.0371 1.0371 1.0381 1.0382 1.1014 1.1014 1.1027 1.1027 1.0906 1.0981 1.0981 1.0962 1.0962 1.0906 1.0906 1.0909 1.0909 1.0945 1.0946
irintensity: 3.0902 0.0002 0.1788 0.0000 1.5308 0.0006 5.0434 0.7466 0.0003 2.8197 0.2742 0.0001 1.7217 0.0367 0.0008 0.3401 7.1281 0.1059 0.0000 3.2936 18.6024 17.5504 2.1524 0.7831 0.0000 0.0026 1.2884 0.0356 15.6326 0.0731 0.0003 13.0818 18.6447 0.1508 0.0001 0.1506 14.8168 0.8718 48.0457 0.0002 0.3395 74.8277 0.0230 26.9654 22.0822 43.0699 1.8027 0.0004 7.8475 1.2255 2.0157 7.5228 32.3578 0.0140 0.0014 0.4771 0.7012 8.0023 0.4272 21.5225 0.0029 284.8788 19.9044 15.9054 2.2558 36.5512 2.9160 96.9046 0.8132 447.4636 22.6469 14.0376 15.1477 132.4316 2.1000 37.7607 0.0847 0.0271 0.2486 96.3197 66.2309 3.5211 70.3279 4.1736 17.4263 14.6120 25.0486 692.6361 34.5582 606.7022 1288.7912 39.2796 6.7576 66.4529 185.5830 0.5670 2.8323 23.1900 2.1844 46.7021 2.2246 1.7050 2.2036 41.8500 9.1496 2.3671 4.8152 0.7376 0.6897 7.2138 3.5721
temp: 298.150 k
press: 1.00000 atm
elementType: 16 7 7 6 6 6 6 6 6 6 6 6 6 6 6 6 6 6 6 6 1 1 1 1 1 1 1 1 1 1 1 1 1 1 1 1 1 1 1
symmnumber: 1
zpe: 840703.3 jmol-1
zpe.correction: 0.320207 hartree
zpe.thermalcorrener: 0.339603 hartree
zpe.thermalcorrenthalpy: 0.340547 hartree
zpe.thermalcorrgfe: 0.272326 hartree
zpe.sumelectzpe: -1165.131534 hartree
zpe.sumelectthermal: -1165.112138 hartree
zpe.sumelectthermalent: -1165.111194 hartree
zpe.sumelectthermalfe: -1165.179415 hartree
dipole: -0.0010 -0.2005 -0.0055
dipole: 0.2006
quadrupole: 13.3831 -96.6229 -129.9116
quadrupole: 0.0021 -0.0087 0.0020
quadrupole: 84.4336 -25.5724 -58.8612 0.0021 -0.0087 0.0020
hfenergy: -1165.451741 hartree
pointgroup: C01 [X(C17H19N2S1)]
dipole: -0.0008155 0.0789181 -0.0007696 debye
polarizability: 616.2356476|2.1512874|208.8106971|-1.8720447|-4.1640044|98.5313141 unknown
InChI: InChI=1S/C17H19N2S/c1-18(2)14-7-5-12-9-13-6-8-15(19(3)4)11-17(13)20-16(12)10-14/h5-11H,1-4H3
charge 1 multiplicity 1
39 atoms
S  -0.014829 1.46635 -0.047134
N  5.119815 0.755379 -0.034822
N  -5.141391 0.700686 0.003925
C  1.263918 -1.078257 0.046149
C  -1.265541 -1.091847 0.055308
C  1.42005 0.35599 -0.009176
C  -1.437508 0.340633 0.001511
C  0.00269 -1.721074 0.074859
C  3.874853 0.168382 -0.009708
C  -3.890154 0.126977 0.019098
C  2.679089 0.962819 -0.036368
C  -2.703102 0.934006 -0.016138
C  2.477482 -1.855753 0.071657
C  -2.470586 -1.882169 0.089251
C  3.732635 -1.271758 0.045267
C  -3.732054 -1.311551 0.072168
C  5.253139 2.226607 -0.087437
C  6.346378 -0.072433 -0.009387
C  -6.359155 -0.139961 0.036068
C  -5.291245 2.170337 -0.046867
H  0.008755 -2.818332 0.116214
H  2.746791 2.052537 -0.078236
H  -2.782584 2.022979 -0.057409
H  2.390896 -2.947411 0.113329
H  -2.372102 -2.972873 0.129885
H  4.617993 -1.910208 0.066823
H  -4.610372 -1.959432 0.099762
H  6.318403 2.496797 -0.095141
H  4.786482 2.703644 0.794822
H  4.789307 2.639666 -1.002885
H  6.403466 -0.67962 0.912901
H  7.226673 0.585078 -0.037547
H  6.395709 -0.746178 -0.884694
H  -7.246383 0.508436 0.015387
H  -6.403484 -0.749639 0.957415
H  -6.407429 -0.812448 -0.840262
H  -6.359387 2.429015 -0.042755
H  -4.84199 2.588853 -0.967139
H  -4.820229 2.652172 0.830407
